program: Gaussian 16
title: indole frequency and population
version: ES64L-G16RevA.03
frameworkgroup: CS[SG(C8H7N)]
method: RB3LYP
basis: Gen
operation: Freq
keyword: #B3LYP/ChkBasis
keyword: Freq=NoRaman
keyword: POP=NBORead
keyword: Integral=UltraFineGrid
keyword: SCRF=(solvent=Dichloromethane)
keyword: #geom=check
keyword: guess=read
title: #B3LYP/ChkBasis Freq=NoRaman POP=NBORead Integral=UltraFineGrid SCRF=(
converged: NO NO NO NO
title: Mulliken charges:
elementType: C C C C C C C C H H H H H H N H
charge: 1.165851 -1.189898 0.107888 -0.393925 0.076055 -0.617257 0.150342 -0.150608 0.137540 0.133074 0.130458 0.136766 0.141928 0.325516 -0.309617 0.155888
chargesum: -0.00000
title: Mulliken charges with hydrogens summed into heavy atoms:
elementType: C C C C C C C C N
charge: 1.165851 -1.189898 0.245428 -0.260851 0.206513 -0.480491 0.292270 0.005280 0.015899
chargesum: 0.00000
1716.lowfreq: -23.1931 -0.0004 -0.0003 0.0008 10.1400 15.9836 216.5661 246.0456 404.6666
frequency: 216.5490 246.0444 404.6661 406.0910 435.3055 550.0822 585.4092 615.2783 615.4933 727.2552 752.8857 772.5507 780.6276 861.1581 873.0325 883.9185 907.5749 943.3764 980.4577 1033.4371 1087.2205 1107.5251 1139.2139 1172.7006 1223.6624 1270.1646 1297.0806 1376.0212 1386.0893 1448.1868 1486.2862 1524.8819 1552.7347 1621.2079 1660.7659 3176.9473 3183.3174 3192.6132 3203.3418 3253.2941 3273.4548 3696.0818
redmass: 3.9705 4.2864 3.7479 1.3492 2.5794 6.6470 3.3761 2.6482 6.5321 1.3335 1.3073 5.0600 2.9346 1.5019 1.3260 4.8992 4.1685 1.3626 1.2605 2.1795 1.5652 1.5149 1.4518 1.1105 2.2540 1.5630 2.7368 5.1344 1.7559 2.7440 2.7477 2.7457 3.9340 5.4492 6.2357 1.0854 1.0887 1.0940 1.0971 1.0906 1.1036 1.0809
irintensity: 19.4251 0.2113 9.2948 118.5050 0.5911 0.1551 0.9389 11.9779 2.4010 45.1487 157.5037 4.6260 21.9328 0.4883 1.4966 1.2153 11.9858 3.3880 0.0019 17.7871 15.9197 49.1321 0.0792 1.8756 5.4971 16.0841 35.1372 49.8165 21.8251 29.4450 45.3896 3.4499 18.7249 1.0170 5.0004 1.9123 5.4033 50.3313 31.1206 3.7167 3.1843 137.1318
temp: 298.150 k
press: 1.00000 atm
elementType: 6 6 6 6 6 6 6 6 1 1 1 1 1 1 7 1
symmnumber: 1
zpe: 340481.0 jmol-1
zpe.correction: 0.129682 hartree
zpe.thermalcorrener: 0.135975 hartree
zpe.thermalcorrenthalpy: 0.136920 hartree
zpe.thermalcorrgfe: 0.099374 hartree
zpe.sumelectzpe: -363.721571 hartree
zpe.sumelectthermal: -363.715278 hartree
zpe.sumelectthermalent: -363.714334 hartree
zpe.sumelectthermalfe: -363.751879 hartree
dipole: -1.1569 2.5951 0.0000
dipole: 2.8413
quadrupole: -46.9528 -41.6795 -59.0806
quadrupole: -2.4713 0.0000 0.0000
quadrupole: 2.2849 7.5581 -9.8430 -2.4713 0.0000 0.0000
hfenergy: -363.8512532 hartree
pointgroup: CS [SG(C8H7N1)]
dipole: 0.4551787 -1.0209904 0. debye
dipolederiv: 0.4063914 -0.2352732 0. 0.2660513 -0.3222732 0. 0. 0. -0.0481599 0.1930006 -0.2679276 0. -0.7840725 0.3278879 0. 0. 0. 0.0756175 0.2034994 0.0815396 0. -0.0415996 0.025892 0. 0. 0. -0.1972161 -0.1212597 0.0480367 0. 0.1823009 0.0719594 0. 0. 0. -0.2135072 -0.1826279 -0.0072546 0. -0.1055127 0.0326784 0. 0. 0. -0.22313 0.1953494 -0.0262338 0. -0.0429351 0.1486136 0. 0. 0. -0.1641633 -0.11023 0.2441747 0. 0.0067793 -0.2598331 0. 0. 0. -0.3067363 -0.0872351 0.5256223 0. 0.3123928 0.7229566 0. 0. 0. -0.1463098 0.0597788 -0.0467188 0. -0.0763035 -0.1107057 0. 0. 0. 0.1833644 -0.1558894 -0.0423563 0. -0.0437876 0.0767572 0. 0. 0. 0.1786316 -0.0348988 0.125504 0. 0.1305813 -0.0610242 0. 0. 0. 0.1811042 0.0585717 -0.0826574 0. -0.0523225 -0.1270158 0. 0. 0. 0.1701318 -0.01703 -0.0732499 0. -0.1016487 0.0164983 0. 0. 0. 0.2214243 0.1883154 -0.0250815 0. -0.0353083 0.316746 0. 0. 0. 0.3780847 -0.5854806 -0.2696491 0. 0.3168947 -0.9298922 0. 0. 0. -0.3049227 -0.0102552 0.051525 0. 0.0684901 0.0707548 0. 0. 0. 0.2157868 unknown
polarizability: 177.7837673|-14.6482789|142.930638|0.|0.|72.7248764 unknown
InChI: InChI=1S/C8H7N/c1-2-4-8-7(3-1)5-6-9-8/h1-6,9H
charge 0 multiplicity 1
16 atoms
C  0.494967 0.618741 0.0000
C  0.0000 -0.716771 0.0000
C  -1.369892 -1.008902 0.0000
C  -2.255428 0.065461 0.0000
C  -1.788219 1.398887 0.0000
C  -0.426706 1.683255 0.0000
C  1.931355 0.532394 0.0000
C  2.255372 -0.800706 0.0000
H  -1.731737 -2.033657 0.0000
H  -3.324738 -0.125296 0.0000
H  -2.507581 2.21278 0.0000
H  -0.077816 2.71242 0.0000
H  2.632775 1.354936 0.0000
H  1.060621 -2.564927 0.0000
N  1.09656 -1.558515 0.0000
H  3.223868 -1.280803 0.0000
