program: Gaussian 16
title: TSendosynfreq wfx and molden orbitals
version: ES64L-G16RevC.01
method: RB3LYP
basis: Gen
operation: SP
keyword: #B3LYP/ChkBasis
keyword: gfinput
keyword: iop(6/7=3)
keyword: output=wfx
keyword: Integral=UltraFineGrid
keyword: #geom=check
keyword: guess=read
title: #B3LYP/ChkBasis gfinput iop(6/7=3) output=wfx Integral=UltraFineGrid #
title: Mulliken charges:
elementType: C C C C C C H H H H H N C H H C C H S O O C H H H C C H C H H H C H C H C H C C C H H C C C H C H C H C H P Au C C H H H C H H H C H H H C C H H H C H H H C H H H C C H C C N H C C C C H H H H H
charge: -0.034987 -0.112012 -0.007858 -0.070581 -0.174260 -0.191169 0.122325 0.135697 0.137286 0.133924 0.114140 -0.353174 -0.332438 0.145022 0.180591 -0.621685 -0.669512 0.166422 1.235574 -0.456401 -0.417021 -0.590280 0.204975 0.211901 0.195207 -0.114358 0.174584 0.144213 0.274165 0.152528 0.149513 0.168285 -0.084031 0.126281 0.136219 0.128946 -0.125906 0.132629 0.005467 -0.423581 -0.217180 0.129641 0.127470 0.205435 0.177105 -0.016283 0.142143 0.022522 0.151009 -0.142788 0.144948 0.029020 0.116804 -1.203262 0.403508 -0.109573 -0.524188 0.147152 0.161699 0.181306 -0.306808 0.176283 0.151620 0.171661 -0.111664 0.164415 0.148337 0.169771 -0.072230 -0.382211 0.157934 0.163560 0.166358 -0.413536 0.165633 0.151736 0.167456 -0.256301 0.164558 0.174609 0.161697 0.067075 -0.107017 0.168025 -0.382886 0.639396 -0.224758 0.337293 -0.159688 -0.232515 -0.199668 -0.316565 0.130509 0.146252 0.149724 0.144362 0.204456
chargesum: 1.00000
totalkineticener: 2.621701955465D+03
dipole: 1.1464 -7.6180 -0.9860
dipole: 7.7666
quadrupole: -223.3384 -262.7571 -286.7577
quadrupole: 18.6611 4.2237 -7.7798
quadrupole: 34.2793 -5.1394 -29.1400 18.6611 4.2237 -7.7798
hfenergy: -2726.9195766 hartree
pointgroup: C01 [X(C41H49Au1N2O2P1S1)]
dipole: 0.4510289 -2.9971366 -0.3879392 debye
InChI: InChI=1S/C21H22N2O2S.C20H27P.Au/c1-26(24,25)23-11-16-18(14-7-3-2-4-8-14)20(16,13-23)19-21(27-19)12-22-17-10-6-5-9-15(17)21;1-19(2,3)21(20(4,5)6)18-15-11-10-14-17(18)16-12-8-7-9-13-16;/h2-10,12,16,18-19,22H,11,13H2,1H3;7-15H,1-6H3;
charge 1 multiplicity 1
97 atoms
C  -4.64702 -0.045956 -1.60844
C  -5.386632 0.688246 -2.548646
C  -6.759828 0.885949 -2.381266
C  -7.416164 0.347424 -1.27039
C  -6.692052 -0.397155 -0.33486
C  -5.319109 -0.594959 -0.505994
H  -4.886304 1.098541 -3.422094
H  -7.317303 1.45449 -3.12025
H  -8.483521 0.49929 -1.139856
H  -7.195879 -0.827507 0.526017
H  -4.766589 -1.184018 0.221159
N  -2.886989 2.099096 -0.301968
C  -2.390879 0.864311 0.346975
H  -1.475604 1.037671 0.925777
H  -3.158735 0.484676 1.023983
C  -2.07746 -0.068959 -0.815606
C  -1.013874 -1.150107 -0.681543
H  -0.724844 -1.536421 -1.660482
S  -2.930667 3.500745 0.64083
O  -2.826163 3.057226 2.038651
O  -1.980298 4.485741 0.099459
C  -4.591358 4.132627 0.362568
H  -5.306337 3.386913 0.710169
H  -4.672672 5.056885 0.938257
H  -4.717703 4.335617 -0.701849
C  -2.419887 2.204163 -1.701136
C  -2.13635 0.765576 -2.083537
H  -1.421538 0.600692 -2.885062
C  -3.185592 -0.307472 -1.8338
H  -3.196745 2.671629 -2.316577
H  -3.006586 -1.196814 -2.441618
H  -1.50752 2.807523 -1.785485
C  1.322117 -2.56628 -3.521649
H  0.594118 -3.127104 -4.101612
C  1.55325 -1.216279 -3.803964
H  0.999632 -0.722273 -4.597589
C  2.523828 -0.505907 -3.091735
H  2.724703 0.532279 -3.340536
C  2.060977 -3.197829 -2.516049
C  3.276535 -1.132224 -2.083739
C  3.031704 -2.486759 -1.80396
H  3.625871 -2.99252 -1.04829
H  1.907227 -4.252566 -2.304546
C  4.453764 -0.425883 -1.475563
C  4.451937 0.378603 -0.308556
C  5.660378 -0.590304 -2.183479
H  5.653259 -1.210226 -3.074977
C  6.844935 0.020893 -1.780606
H  7.755296 -0.12713 -2.353481
C  6.843351 0.826793 -0.642468
H  7.751164 1.321811 -0.311414
C  5.661804 0.994921 0.075287
H  5.689197 1.624125 0.954036
P  2.956337 0.687831 0.74587
Au 0.920399 -0.322312 -0.013129
C  2.685084 2.596529 0.779466
C  1.229532 2.874185 1.215747
H  0.508324 2.413002 0.536174
H  1.013345 2.529727 2.229387
H  1.048487 3.953974 1.18988
C  2.859766 3.089906 -0.6740
H  3.892185 3.006223 -1.022133
H  2.214732 2.542849 -1.37039
H  2.57062 4.145822 -0.7214
C  3.627866 3.3861 1.708857
H  3.500405 3.11347 2.759438
H  4.681989 3.285128 1.442899
H  3.379016 4.450141 1.621583
C  3.344604 -0.087819 2.460954
C  2.197014 0.264544 3.430737
H  1.214789 0.017956 3.01572
H  2.324195 -0.315717 4.351988
H  2.199789 1.321539 3.709853
C  3.371477 -1.617145 2.237804
H  3.584812 -2.109872 3.193623
H  2.412179 -1.995458 1.871524
H  4.154362 -1.912497 1.532084
C  4.688698 0.32425 3.09449
H  4.755592 -0.144755 4.083307
H  5.543057 -0.028741 2.513226
H  4.783142 1.401771 3.242463
C  -1.495961 -2.436625 0.106143
C  -1.683156 -3.693616 -0.497758
H  -1.412078 -4.013394 -1.494502
C  -2.536547 -3.883382 1.579925
C  -2.062345 -2.5549 1.45663
N  -2.282377 -4.533686 0.371658
H  -2.501616 -5.502165 0.179742
C  -3.121301 -4.382628 2.746768
C  -3.220518 -3.510103 3.825842
C  -2.737834 -2.188321 3.737666
C  -2.156981 -1.702266 2.569412
H  -1.78832 -0.683955 2.531834
H  -2.8236 -1.534024 4.599485
H  -3.671616 -3.853848 4.751062
H  -3.479726 -5.40546 2.811689
H  -0.32195 -1.998494 0.231803
