program: Gaussian 16
title: title
version: ES64L-G16RevC.01
method: RB3LYP
basis: GenECP
operation: Freq
keyword: #N
keyword: Geom=AllCheck
keyword: Guess=TCheck
keyword: SCRF=Check
keyword: GenChk
keyword: RB3LYP/GenECP
keyword: Freq
converged: YES YES YES YES
title: Mulliken charges:
elementType: Rh O C O Rh O C O O C O O C O C C H C C H H H H H H N C C H C C H H H H H H C C H C C H H H H H H C C H C C H H H H H H S C C C C H C H C H H H O O N S N N S S C C C C H C H C H H H C C C C H C H C H H H C C C C H C H C H H H O O O O O O C C H C H C C C C H C H C H H H C O O C H H H
charge: 0.378577 -0.496243 0.695972 -0.498085 0.547050 -0.493698 0.707178 -0.509212 -0.522838 0.697256 -0.499206 -0.514510 0.688917 -0.495889 -0.034596 -0.311135 0.189331 -0.166136 -0.271365 0.145469 0.205445 0.172921 0.204857 0.146396 0.148146 -0.539849 -0.042429 -0.298733 0.190517 -0.115248 -0.321573 0.159041 0.175809 0.147494 0.201788 0.148072 0.203492 -0.086789 -0.305146 0.246969 -0.158829 -0.278646 0.172878 0.167240 0.191139 0.155852 0.162975 0.141443 -0.051982 -0.296096 0.178698 -0.119544 -0.342968 0.155459 0.172255 0.147504 0.193974 0.152889 0.230548 1.230274 -0.124423 -0.125129 -0.128736 -0.109648 0.155790 -0.160015 0.171853 -0.126161 0.136047 0.200892 0.143063 -0.568776 -0.541569 -0.559862 1.313048 -0.537220 -0.560119 1.305402 1.239388 -0.141743 -0.144636 -0.144638 -0.126236 0.175833 -0.125486 0.173547 -0.119438 0.144406 0.144438 0.142599 -0.146245 -0.139449 -0.159504 -0.127983 0.163336 -0.133531 0.224094 -0.119699 0.138520 0.146548 0.137063 -0.152041 -0.158368 -0.110470 -0.128964 0.172419 -0.146794 0.197425 -0.129234 0.129543 0.158373 0.131080 -0.556806 -0.538271 -0.549770 -0.578537 -0.541019 -0.573562 -0.104092 -0.131255 0.187479 -0.135691 0.178318 0.160385 -0.178136 -0.163340 -0.128495 0.151271 -0.129677 0.165114 -0.114296 0.149658 0.152759 0.151676 0.536276 -0.417490 -0.418231 -0.223849 0.177553 0.160933 0.179421
chargesum: -0.00000
title: Mulliken charges with hydrogens summed into heavy atoms:
elementType: Rh O C O Rh O C O O C O O C O C C C C N C C C C C C C C C C C C S C C C C C C O O N S N N S S C C C C C C C C C C C C C C C C C C O O O O O O C C C C C C C C C C O O C
charge: 0.378577 -0.496243 0.695972 -0.498085 0.547050 -0.493698 0.707178 -0.509212 -0.522838 0.697256 -0.499206 -0.514510 0.688917 -0.495889 0.154735 0.039779 0.211643 0.023177 -0.539849 0.148089 0.036117 0.234034 0.029992 0.160180 0.034971 0.188162 0.025772 0.126716 0.031618 0.221935 0.040469 1.230274 -0.124423 0.030661 0.043117 0.026400 0.040877 0.016902 -0.568776 -0.541569 -0.559862 1.313048 -0.537220 -0.560119 1.305402 1.239388 -0.141743 0.031197 0.028910 0.018171 0.018952 0.023161 -0.146245 0.023887 0.064590 0.010538 0.013017 0.017364 -0.152041 0.014051 0.086955 0.000579 0.011579 0.001846 -0.556806 -0.538271 -0.549770 -0.578537 -0.541019 -0.573562 -0.104092 0.056224 0.042627 0.160385 -0.026865 0.001774 0.021162 0.023083 0.037380 0.536276 -0.417490 -0.418231 0.294058
chargesum: -0.00004
1716.lowfreq: -2.9780 -1.6164 -0.0030 -0.0023 0.0017 0.8414 8.7924 12.4758 15.0500
temp: 298.150 k
press: 1.00000 atm
elementType: 45 8 6 8 45 8 6 8 8 6 8 8 6 8 6 6 1 6 6 1 1 1 1 1 1 7 6 6 1 6 6 1 1 1 1 1 1 6 6 1 6 6 1 1 1 1 1 1 6 6 1 6 6 1 1 1 1 1 1 16 6 6 6 6 1 6 1 6 1 1 1 8 8 7 16 7 7 16 16 6 6 6 6 1 6 1 6 1 1 1 6 6 6 6 1 6 1 6 1 1 1 6 6 6 6 1 6 1 6 1 1 1 8 8 8 8 8 8 6 6 1 6 1 6 6 6 6 1 6 1 6 1 1 1 6 8 8 6 1 1 1
symmnumber: 1
zpe: 2875958.5 jmol-1
zpe.correction: 1.095395 hartree
zpe.thermalcorrener: 1.173981 hartree
zpe.thermalcorrenthalpy: 1.174925 hartree
zpe.thermalcorrgfe: 0.971521 hartree
zpe.sumelectzpe: -5514.573386 hartree
zpe.sumelectthermal: -5514.494800 hartree
zpe.sumelectthermalent: -5514.493856 hartree
zpe.sumelectthermalfe: -5514.697260 hartree
dipole: -0.8242 9.4387 1.0839
dipole: 9.5364
quadrupole: -473.7694 -506.9669 -491.8297
quadrupole: 16.2233 -67.0939 33.0301
quadrupole: 17.0859 -16.1116 -0.9743 16.2233 -67.0939 33.0301
hfenergy: -5515.668781 hartree
pointgroup: C01 [X(C55H58N4O18Rh2S4)]
dipole: 0.1214138 -3.7362555 0.3203091 debye
polarizability: 884.2295634|-84.4603263|813.3487138|55.7917169|-103.1928043|797.4767901 unknown
InChI: InChI=1S/4C11H12NO4S.C11H10O2.2Rh/c4*13-11(14)10-7-4-8-12(10)17(15,16)9-5-2-1-3-6-9;1-13-11(12)9-5-8-10-6-3-2-4-7-10;;/h4*1-3,5-6,10H,4,7-8H2;2-8H,1H3;;/q4*-2;;2*+4
charge 0 multiplicity 1
141 atoms
Rh -0.67030231 1.21356909 -0.58899548
O  0.75933279 1.10213759 -2.09489342
C  1.44365399 0.04628805 -2.193592
O  1.29493075 -1.03779927 -1.53920985
Rh -0.01865364 -1.08592557 0.06052081
O  -1.55565469 -1.73650416 -1.16170824
C  -2.26269636 -0.87472471 -1.77093523
O  -2.08611924 0.37559852 -1.83065528
O  1.4586796 -0.24533714 1.25786557
C  1.56720121 1.02545474 1.27094737
O  0.78932382 1.86308897 0.74690987
O  -1.30871058 -0.90209441 1.69175566
C  -2.0040305 0.16790522 1.76765845
O  -2.03275422 1.11419226 0.94177404
C  -2.88289239 0.31489028 3.01225703
C  -3.99658042 -0.77859973 3.03209982
H  -2.21789122 0.25148433 3.87705027
C  -4.97058993 1.3906791 2.4780348
C  -5.34046623 -0.01164424 2.97622386
H  -3.91568861 -1.39451455 3.93155619
H  -3.88220469 -1.43104117 2.16558909
H  -5.63770371 2.17322567 2.84554685
H  -4.9247788 1.42659788 1.38507231
H  -5.781888 0.0601546 3.97539938
H  -6.05741843 -0.4987135 2.30998355
N  -3.63420349 1.56862108 3.06456591
C  -3.44802642 -1.43210924 -2.56623248
C  -3.10069992 -1.54377296 -4.0634572
H  -3.73563069 -2.38701837 -2.12437557
C  -4.55047125 0.3940305 -3.78636836
C  -3.33889423 -0.11730255 -4.59239953
H  -3.78809205 -2.25628298 -4.53245556
H  -2.07833487 -1.90151914 -4.21753486
H  -5.49204756 0.29373376 -4.34018872
H  -4.42974447 1.43461341 -3.4778435
H  -3.52219496 -0.09458891 -5.67049416
H  -2.46921348 0.50733132 -4.37360385
C  2.57197821 0.09773109 -3.22419008
C  2.00109646 0.32739849 -4.66138219
H  3.22543561 0.91479098 -2.91346474
C  2.94584226 -1.87806671 -4.53364219
C  2.68677932 -0.74247192 -5.52991338
H  2.19277668 1.34722174 -5.00203767
H  0.91516795 0.18550825 -4.6563563
H  3.72685944 -2.57425424 -4.83648789
H  2.02529038 -2.43991653 -4.32710179
H  3.6472478 -0.37681662 -5.9105047
H  2.07364926 -1.05267353 -6.38259368
C  2.79360202 1.56409731 2.01854361
C  2.50333816 1.76956183 3.51671149
H  3.61676264 0.86767973 1.84572352
C  2.52551579 3.95793819 2.44019158
C  1.83304351 3.15467747 3.56239875
H  3.4537457 1.77060242 4.06163863
H  1.87275526 0.97259682 3.92148129
H  3.30461374 4.62523869 2.82772013
H  1.81715628 4.55186327 1.85814722
H  1.94333231 3.63834931 4.53684569
H  0.7628488 3.05506706 3.36753698
S  -2.93086207 3.07884663 3.19895106
C  -2.61628786 3.74661785 1.55661935
C  -3.68093287 3.9442985 0.67390684
C  -1.30112258 3.98536059 1.16522763
C  -3.40812136 4.33865774 -0.63484589
H  -4.7032096 3.77305036 0.98978842
C  -1.03327312 4.39208278 -0.1442329
H  -0.49205846 3.79309143 1.85432465
C  -2.08902199 4.55561382 -1.04677607
H  -4.22834563 4.45777498 -1.33619173
H  -0.0026126 4.54147427 -0.45476883
H  -1.88159059 4.84788157 -2.07269713
O  -1.63182335 2.84453269 3.85024625
O  -3.95383375 3.93569463 3.80782092
N  -4.58630372 -0.50224778 -2.60616781
S  -5.27490014 0.01845639 -1.1751353
N  3.3323287 -1.16040552 -3.30561048
N  3.16267467 2.91673551 1.59577821
S  3.42739814 3.1966733 -0.04262122
S  4.91898227 -1.22662965 -2.75324818
C  -6.96023866 -0.58976969 -1.27863859
C  -7.24503968 -1.87756969 -0.81850485
C  -7.94836824 0.22628349 -1.83219858
C  -8.55030377 -2.35727929 -0.92501664
H  -6.45755794 -2.47665031 -0.37342825
C  -9.24964755 -0.26747306 -1.9365051
H  -7.69925829 1.23228713 -2.15278755
C  -9.54906406 -1.55592006 -1.4863788
H  -8.78874787 -3.35419859 -0.56551075
H  -10.030237 0.35732199 -2.36105445
H  -10.56449164 -1.93405729 -1.56579932
C  5.13629554 3.73105797 -0.10641381
C  5.45943942 5.02429431 0.3132863
C  6.10403459 2.84091991 -0.5752474
C  6.79391315 5.42580296 0.28378599
H  4.67754484 5.70424461 0.63641789
C  7.43521562 3.26301704 -0.6064902
H  5.81745906 1.8574837 -0.93355103
C  7.78014909 4.5449246 -0.17275368
H  7.06308847 6.42762351 0.60643651
H  8.19942556 2.58696259 -0.97896533
H  8.81834275 4.86479593 -0.19973082
C  4.8143158 -2.02697577 -1.14946364
C  5.48031943 -3.23832804 -0.96047253
C  4.09772723 -1.41467764 -0.11968045
C  5.42185823 -3.852983 0.29257076
H  6.03361797 -3.68011803 -1.78210461
C  4.04251535 -2.04303154 1.12252208
H  3.57969894 -0.47944004 -0.28433908
C  4.70543047 -3.25586716 1.33132688
H  5.941264 -4.79386359 0.4540086
H  3.45110382 -1.59274321 1.9115777
H  4.6566144 -3.73740248 2.30459231
O  5.65744044 -2.13384705 -3.64410201
O  5.39161152 0.14568935 -2.52275317
O  -5.3538909 1.48420137 -1.15839658
O  -4.60858862 -0.7323207 -0.10000586
O  2.5970135 4.32439196 -0.48356505
O  3.37100277 1.88086091 -0.6980904
C  0.55367781 -2.91799941 0.59203838
C  0.76237413 -3.23765992 1.94700038
H  0.38541454 -2.52683113 2.67758947
C  1.55474916 -4.29179026 2.33149779
H  1.93055741 -4.94838663 1.54874063
C  2.02908819 -4.58443971 3.66651435
C  2.89477136 -5.68553126 3.84755688
C  1.67970545 -3.80744074 4.79436375
C  3.39108812 -6.00392758 5.10756184
H  3.17274276 -6.28638258 2.98524514
C  2.17521701 -4.12967897 6.05114199
H  1.02300671 -2.95129045 4.68036995
C  3.03157169 -5.22662114 6.2122396
H  4.05591 -6.85373691 5.2306723
H  1.89942094 -3.52580379 6.91060969
H  3.41843577 -5.47142665 7.1973774
C  0.80776936 -3.88433963 -0.49574909
O  -0.08560549 -4.54615676 -0.98870238
O  2.08749083 -3.88785673 -0.90084843
C  2.35371833 -4.60709452 -2.11822802
H  3.36955721 -4.33280819 -2.39697175
H  2.27360483 -5.68555432 -1.95133248
H  1.6434987 -4.3099158 -2.89302848
