program: Gaussian 16
title: title
version: ES64L-G16RevC.01
method: RB3LYP
basis: GenECP
operation: Freq
keyword: #N
keyword: Geom=AllCheck
keyword: Guess=TCheck
keyword: SCRF=Check
keyword: GenChk
keyword: RB3LYP/GenECP
keyword: Freq
converged: YES YES YES YES
title: Mulliken charges:
elementType: Rh O C O Rh O C O O C O O C O C C H C C H H H H H H N C C H C C H H H H H H C C H C C H H H H H H C C H C C H H H H H H S C C C C H C H C H H H O O N S N N S S C C C C H C H C H H H C C C C H C H C H H H C C C C H C H C H H H O O O O O O C C H C H C C C C H C H C H H H C O O C H H H
charge: 0.391843 -0.509210 0.706031 -0.496476 0.535921 -0.498255 0.698700 -0.509215 -0.532488 0.707756 -0.498588 -0.506778 0.719893 -0.514526 -0.031682 -0.330777 0.179442 -0.115369 -0.312820 0.147134 0.228312 0.158353 0.164767 0.145567 0.216932 -0.564681 -0.044258 -0.301449 0.195476 -0.116309 -0.323034 0.159888 0.174612 0.149043 0.200895 0.149154 0.198544 -0.073156 -0.289205 0.233173 -0.102535 -0.341865 0.159390 0.185571 0.174905 0.162177 0.149081 0.174872 -0.043182 -0.306241 0.177142 -0.110685 -0.316463 0.149282 0.193367 0.141538 0.184914 0.142833 0.198678 1.232752 -0.202822 -0.137594 -0.143149 -0.129575 0.176244 -0.137812 0.252592 -0.123916 0.139832 0.175899 0.143497 -0.574222 -0.525492 -0.561258 1.297231 -0.539460 -0.561174 1.295204 1.230503 -0.147507 -0.138397 -0.144598 -0.127066 0.175696 -0.126156 0.175929 -0.119537 0.144060 0.143435 0.141781 -0.149688 -0.141787 -0.159182 -0.127833 0.160307 -0.134260 0.227511 -0.120624 0.135385 0.146817 0.135477 -0.148019 -0.155792 -0.120284 -0.125392 0.169928 -0.144080 0.200323 -0.123504 0.129472 0.156094 0.125171 -0.556370 -0.546621 -0.538079 -0.571557 -0.539172 -0.572152 -0.073531 -0.188840 0.155803 -0.116451 0.235254 0.142774 -0.200012 -0.156136 -0.141124 0.224506 -0.132332 0.146094 -0.112283 0.156541 0.144369 0.147250 0.537685 -0.422993 -0.403104 -0.224618 0.172707 0.171098 0.174396
chargesum: -0.00000
title: Mulliken charges with hydrogens summed into heavy atoms:
elementType: Rh O C O Rh O C O O C O O C O C C C C N C C C C C C C C C C C C S C C C C C C O O N S N N S S C C C C C C C C C C C C C C C C C C O O O O O O C C C C C C C C C C O O C
charge: 0.391843 -0.509210 0.706031 -0.496476 0.535921 -0.498255 0.698700 -0.509215 -0.532488 0.707756 -0.498588 -0.506778 0.719893 -0.514526 0.147760 0.044669 0.207751 0.049680 -0.564681 0.151219 0.033051 0.233628 0.024665 0.160016 0.055756 0.234547 -0.017912 0.133959 0.036408 0.215768 0.025048 1.232752 -0.202822 0.038650 0.109444 0.010257 0.038087 0.019581 -0.574222 -0.525492 -0.561258 1.297231 -0.539460 -0.561174 1.295204 1.230503 -0.147507 0.037299 0.031331 0.016994 0.017280 0.022244 -0.149688 0.018520 0.068329 0.007552 0.012557 0.014853 -0.148019 0.014137 0.080039 0.004080 0.012014 0.001667 -0.556370 -0.546621 -0.538079 -0.571557 -0.539172 -0.572152 -0.073531 -0.033036 0.118803 0.142774 0.024494 -0.010042 0.015417 0.012037 0.034968 0.537685 -0.422993 -0.403104 0.293584
chargesum: -0.00004
1716.lowfreq: -1.5276 -0.0034 -0.0029 -0.0012 1.4385 2.1157 7.3290 8.6835 10.3191
temp: 298.150 k
press: 1.00000 atm
elementType: 45 8 6 8 45 8 6 8 8 6 8 8 6 8 6 6 1 6 6 1 1 1 1 1 1 7 6 6 1 6 6 1 1 1 1 1 1 6 6 1 6 6 1 1 1 1 1 1 6 6 1 6 6 1 1 1 1 1 1 16 6 6 6 6 1 6 1 6 1 1 1 8 8 7 16 7 7 16 16 6 6 6 6 1 6 1 6 1 1 1 6 6 6 6 1 6 1 6 1 1 1 6 6 6 6 1 6 1 6 1 1 1 8 8 8 8 8 8 6 6 1 6 1 6 6 6 6 1 6 1 6 1 1 1 6 8 8 6 1 1 1
symmnumber: 1
zpe: 2877104.0 jmol-1
zpe.correction: 1.095831 hartree
zpe.thermalcorrener: 1.174443 hartree
zpe.thermalcorrenthalpy: 1.175387 hartree
zpe.thermalcorrgfe: 0.970634 hartree
zpe.sumelectzpe: -5514.586259 hartree
zpe.sumelectthermal: -5514.507648 hartree
zpe.sumelectthermalent: -5514.506703 hartree
zpe.sumelectthermalfe: -5514.711456 hartree
dipole: -4.3181 1.7601 3.3567
dipole: 5.7455
quadrupole: -479.3334 -498.3421 -489.6798
quadrupole: 49.7503 23.3182 -0.7075
quadrupole: 9.7850 -9.2237 -0.5614 49.7503 23.3182 -0.7075
hfenergy: -5515.6820905 hartree
pointgroup: C01 [X(C55H58N4O18Rh2S4)]
dipole: 1.7134006 0.1879314 -1.4623913 debye
polarizability: 788.3997467|-11.0279724|808.8854378|15.4929157|-30.0725376|842.177918 unknown
InChI: InChI=1S/4C11H12NO4S.C11H10O2.2Rh/c4*13-11(14)10-7-4-8-12(10)17(15,16)9-5-2-1-3-6-9;1-13-11(12)9-5-8-10-6-3-2-4-7-10;;/h4*1-3,5-6,10H,4,7-8H2;2-8H,1H3;;/q4*-2;;2*+4
charge 0 multiplicity 1
141 atoms
Rh 0.65357514 -0.1314428 0.64579753
O  -0.73717809 -1.28119297 1.64963727
C  -1.41992437 -2.11941644 0.996055
O  -1.32039327 -2.40709967 -0.24070193
Rh 0.04828484 -1.38658236 -1.41400798
O  1.49955481 -2.77595929 -0.89417652
C  2.21433605 -2.52965548 0.127897
O  2.08313939 -1.58658338 0.95954941
O  -1.39197789 0.07024911 -1.73078969
C  -1.58770044 0.96455577 -0.83896314
O  -0.85266103 1.23032143 0.14680442
O  1.47190555 -0.2406019 -2.3965536
C  2.06620799 0.68953827 -1.76235613
O  2.008577 0.92349631 -0.52329205
C  2.94980694 1.60049162 -2.61837119
C  4.45096309 1.25028939 -2.50087575
H  2.59344216 1.52382121 -3.6473722
C  4.1954441 3.4584325 -1.57669904
C  4.94363082 2.13738815 -1.34630084
H  4.94454936 1.53110989 -3.43866092
H  4.61363235 0.18734833 -2.31971513
H  4.70973698 4.10705922 -2.29812297
H  4.02578018 4.02311504 -0.65430206
H  6.02915898 2.27217858 -1.35024462
H  4.65203523 1.69459289 -0.3892727
N  2.91410138 2.98417344 -2.12590918
C  3.34318355 -3.52706377 0.41161361
C  2.89427009 -4.5847416 1.4377383
H  3.66480654 -3.95884749 -0.53650389
C  4.30361265 -2.96428919 2.59487971
C  3.06230221 -3.86318235 2.78813241
H  3.56492883 -5.44797217 1.36734314
H  1.87289475 -4.92830067 1.25207625
H  5.20732317 -3.39369371 3.04365702
H  4.14700909 -1.96166105 2.9996547
H  3.18275597 -4.55961533 3.62272819
H  2.18770199 -3.23736758 2.98390815
C  -2.4502282 -2.90978277 1.81824555
C  -1.71706921 -3.76924404 2.86721586
H  -3.14989369 -2.18971626 2.24414081
C  -2.44409881 -5.22838169 1.05487888
C  -1.2706194 -4.98120606 2.02908038
H  -2.43045179 -4.07071852 3.64149713
H  -0.89015233 -3.23071377 3.33479879
H  -3.1206245 -6.01447849 1.40058157
H  -2.08887168 -5.48344234 0.05285773
H  -1.04404291 -5.86503479 2.63227752
H  -0.37131929 -4.71959905 1.45977968
C  -2.8896208 1.75670849 -1.03840145
C  -2.6968241 2.99967249 -1.93115286
H  -3.61406064 1.05923056 -1.46562288
C  -3.09339841 3.77986354 0.34153521
C  -2.28603112 4.09014285 -0.92996059
H  -3.6533832 3.23958902 -2.40888726
H  -1.94337144 2.8391492 -2.70523429
H  -4.02886024 4.35284881 0.39412073
H  -2.51630767 3.96196055 1.25133839
H  -2.46654841 5.10189275 -1.30339659
H  -1.22371712 3.99268658 -0.71391796
S  1.64188712 3.98072865 -2.44088277
C  1.24341139 4.68934329 -0.84269754
C  0.89297201 6.03968599 -0.78312982
C  1.15191187 3.85247578 0.27261117
C  0.42558291 6.55793799 0.42553797
H  0.98297768 6.65871444 -1.66917877
C  0.67983091 4.38401473 1.47260553
H  1.43279235 2.81015822 0.19177271
C  0.31214577 5.73091838 1.54714062
H  0.14685875 7.6059471 0.48966962
H  0.58399162 3.73831019 2.34038516
H  -0.06263987 6.13738913 2.48257001
O  0.54389593 3.07748707 -2.85364951
O  2.0151592 5.09147363 -3.32808128
N  4.4753905 -2.91663361 1.12289711
S  5.27404731 -1.62214703 0.42238309
N  -3.15123983 -3.9352527 1.05179462
N  -3.40564137 2.34410438 0.19596539
S  -3.73781587 1.38276449 1.51908922
S  -4.64835906 -3.76275726 0.37107439
C  6.98360691 -2.16649853 0.4535141
C  7.4485588 -2.99141299 -0.5734219
C  7.80656044 -1.77631433 1.51084092
C  8.76836873 -3.43857618 -0.5318478
H  6.78732534 -3.25860513 -1.39114382
C  9.12502225 -2.23493693 1.54283823
H  7.41962904 -1.1138762 2.27780843
C  9.60335135 -3.06468493 0.52610476
H  9.14689697 -4.07523672 -1.32642722
H  9.77875041 -1.93795246 2.35795719
H  10.63102287 -3.41629429 0.5534985
C  -5.51453255 1.52348754 1.71257543
C  -6.04368001 2.68928493 2.27427446
C  -6.32911234 0.4726114 1.2881716
C  -7.42747439 2.8121749 2.3895348
H  -5.38075034 3.47061189 2.63194745
C  -7.71305112 0.60816968 1.42021785
H  -5.8902378 -0.44030305 0.90041578
C  -8.2607754 1.77400578 1.9598537
H  -7.85497958 3.71139056 2.82440342
H  -8.35917306 -0.20697678 1.10737663
H  -9.33866719 1.87138828 2.05816832
C  -4.4094985 -3.29538479 -1.3468743
C  -4.73930233 -4.20746893 -2.34998985
C  -3.90377678 -2.02897404 -1.64570459
C  -4.55154464 -3.84298058 -3.68517128
H  -5.14598305 -5.17580546 -2.079071
C  -3.71169838 -1.68182899 -2.98112156
H  -3.64845465 -1.33781565 -0.85270368
C  -4.03526765 -2.58461652 -3.99850355
H  -4.8101561 -4.54215763 -4.47593879
H  -3.28034084 -0.71587437 -3.21698885
H  -3.88086652 -2.30373924 -5.03747587
O  -5.25739823 -5.09947127 0.36503316
O  -5.29618017 -2.62999741 1.04352431
O  5.19225598 -0.42448164 1.26698792
O  4.8301926 -1.60039104 -0.98035642
O  -3.12036991 1.97645052 2.70906954
O  -3.45774375 0.00288856 1.09456583
C  -0.40508806 -2.31768433 -3.14224299
C  -0.56207862 -1.70422985 -4.3972678
H  -0.72097593 -2.34414285 -5.26605192
C  -0.50499813 -0.33401203 -4.56860939
H  -0.31537921 0.27216523 -3.69303085
C  -0.66745734 0.39928131 -5.79914242
C  -0.43844418 1.79513261 -5.76119865
C  -1.03534231 -0.20012538 -7.02663215
C  -0.5634552 2.56155266 -6.91600427
H  -0.14741015 2.2630699 -4.82410075
C  -1.16593839 0.57240177 -8.17210919
H  -1.22531106 -1.26775378 -7.07435338
C  -0.92830882 1.95364332 -8.12025057
H  -0.37617785 3.63048849 -6.87538835
H  -1.45280868 0.10627899 -9.11033675
H  -1.03032982 2.55201915 -9.02159793
C  -0.41064828 -3.80019865 -3.15779323
O  0.48982339 -4.42758539 -3.68592461
O  -1.46644064 -4.3471116 -2.54336654
C  -1.52972136 -5.7820682 -2.59561859
H  -2.51151208 -6.04009653 -2.2008862
H  -1.42266966 -6.1358271 -3.62488749
H  -0.73530048 -6.21941312 -1.98372961
