program: Gaussian 16
title: title
version: ES64L-G16RevC.01
method: RB3LYP
basis: GenECP
operation: Freq
keyword: #N
keyword: Geom=AllCheck
keyword: Guess=TCheck
keyword: SCRF=Check
keyword: GenChk
keyword: RB3LYP/GenECP
keyword: Freq
converged: YES YES NO YES
title: Mulliken charges:
elementType: Rh O C O Rh O C O O C O O C O C C H C C H H H H H H N C C H C C H H H H H H C C H C C H H H H H H C C H C C H H H H H H S C C C C H C H C H H H O O N S N N S S C C C C H C H C H H H C C C C H C H C H H H C C C C H C H C H H H O O O O O O C C O O C H H H C H C H C C C C H C H C H H H
charge: 0.502113 -0.518727 0.734013 -0.503555 0.450620 -0.510586 0.720995 -0.507360 -0.504427 0.702572 -0.513644 -0.503250 0.710890 -0.513214 -0.011652 -0.314983 0.186378 -0.121201 -0.296568 0.153051 0.184557 0.179618 0.165343 0.157473 0.152070 -0.564730 -0.100777 -0.315104 0.239301 -0.173081 -0.280182 0.148167 0.199233 0.186152 0.184322 0.154478 0.143831 -0.021427 -0.308004 0.183337 -0.123762 -0.302091 0.190006 0.173249 0.181507 0.156215 0.156662 0.151283 -0.009292 -0.310405 0.192231 -0.131038 -0.297596 0.174807 0.156350 0.179205 0.167279 0.160381 0.146130 1.266875 -0.190346 -0.143886 -0.128778 -0.131144 0.170055 -0.135520 0.239047 -0.124044 0.135727 0.170880 0.134412 -0.573671 -0.536543 -0.540520 1.244766 -0.583221 -0.572407 1.270203 1.260865 -0.160316 -0.143698 -0.125917 -0.135547 0.173970 -0.153470 0.245083 -0.125225 0.132325 0.159402 0.134102 -0.168263 -0.144002 -0.144484 -0.177172 0.238046 -0.134962 0.172541 -0.137773 0.193245 0.138556 0.141209 -0.193560 -0.140719 -0.117820 -0.147022 0.210947 -0.132385 0.197496 -0.127736 0.159606 0.144747 0.132626 -0.524284 -0.554171 -0.544906 -0.552887 -0.560604 -0.541984 -0.086611 0.552116 -0.439665 -0.400881 -0.235573 0.167738 0.197292 0.177980 -0.090412 0.208211 -0.189377 0.169617 0.149983 -0.180489 -0.159658 -0.132922 0.150373 -0.136245 0.167033 -0.118883 0.147388 0.148044 0.150030
chargesum: -0.00000
title: Mulliken charges with hydrogens summed into heavy atoms:
elementType: Rh O C O Rh O C O O C O O C O C C C C N C C C C C C C C C C C C S C C C C C C O O N S N N S S C C C C C C C C C C C C C C C C C C O O O O O O C C O O C C C C C C C C C
charge: 0.502113 -0.518727 0.734013 -0.503555 0.450620 -0.510586 0.720995 -0.507360 -0.504427 0.702572 -0.513644 -0.503250 0.710890 -0.513214 0.174726 0.022626 0.223760 0.012975 -0.564730 0.138524 0.032296 0.197394 0.018127 0.161910 0.055251 0.213960 0.005854 0.182939 0.020752 0.215446 0.008915 1.266875 -0.190346 0.026170 0.110269 0.004583 0.035360 0.010368 -0.573671 -0.536543 -0.540520 1.244766 -0.583221 -0.572407 1.270203 1.260865 -0.160316 0.030272 0.119166 -0.003223 0.005931 0.008877 -0.168263 0.094043 0.028057 0.016073 0.003594 0.003436 -0.193560 0.070228 0.079676 0.012584 0.012362 0.004890 -0.524284 -0.554171 -0.544906 -0.552887 -0.560604 -0.541984 -0.086611 0.552116 -0.439665 -0.400881 0.307437 0.117799 -0.019761 0.149983 -0.030116 0.007375 0.014466 0.011799 0.031148
chargesum: -0.00004
1716.lowfreq: -3.7119 -1.4110 -0.0030 -0.0024 -0.0015 1.4713 6.9401 18.5158 21.9296
temp: 298.150 k
press: 1.00000 atm
elementType: 45 8 6 8 45 8 6 8 8 6 8 8 6 8 6 6 1 6 6 1 1 1 1 1 1 7 6 6 1 6 6 1 1 1 1 1 1 6 6 1 6 6 1 1 1 1 1 1 6 6 1 6 6 1 1 1 1 1 1 16 6 6 6 6 1 6 1 6 1 1 1 8 8 7 16 7 7 16 16 6 6 6 6 1 6 1 6 1 1 1 6 6 6 6 1 6 1 6 1 1 1 6 6 6 6 1 6 1 6 1 1 1 8 8 8 8 8 8 6 6 8 8 6 1 1 1 6 1 6 1 6 6 6 6 1 6 1 6 1 1 1
symmnumber: 1
zpe: 2880161.8 jmol-1
zpe.correction: 1.096996 hartree
zpe.thermalcorrener: 1.174554 hartree
zpe.thermalcorrenthalpy: 1.175498 hartree
zpe.thermalcorrgfe: 0.979911 hartree
zpe.sumelectzpe: -5514.590148 hartree
zpe.sumelectthermal: -5514.512590 hartree
zpe.sumelectthermalent: -5514.511645 hartree
zpe.sumelectthermalfe: -5514.707233 hartree
dipole: -11.6277 7.3599 4.2235
dipole: 14.3948
quadrupole: -489.4971 -501.9132 -517.8053
quadrupole: -3.6996 -34.7521 -31.1865
quadrupole: 13.5747 1.1587 -14.7334 -3.6996 -34.7521 -31.1865
hfenergy: -5515.6871438 hartree
pointgroup: C01 [X(C55H58N4O18Rh2S4)]
dipole: -4.2335402 3.4346157 1.534326 debye
polarizability: 992.7787713|-77.0259513|730.5684844|-43.6598915|-28.1128545|680.8764481 unknown
InChI: InChI=1S/4C11H12NO4S.C11H10O2.2Rh/c4*13-11(14)10-7-4-8-12(10)17(15,16)9-5-2-1-3-6-9;1-13-11(12)9-5-8-10-6-3-2-4-7-10;;/h4*1-3,5-6,10H,4,7-8H2;2-8H,1H3;;/q4*-2;;2*+4
charge 0 multiplicity 1
141 atoms
Rh -0.82174893 0.46302298 0.32719885
O  -1.17995248 -1.42477632 -0.45111574
C  -0.70104372 -1.71227229 -1.60277798
O  -0.04069523 -0.95492237 -2.36262749
Rh 0.60920774 0.86363901 -1.64829122
O  2.12527571 -0.04787973 -0.55451191
C  1.90365876 -0.46356326 0.61717215
O  0.81324112 -0.34750937 1.27453427
O  -1.0521209 1.72378425 -2.57962165
C  -2.16298443 1.63739611 -1.99090991
O  -2.38336359 1.19963391 -0.81463496
O  1.15730142 2.67293415 -0.79102756
C  0.61079913 3.0084886 0.29327746
O  -0.31386449 2.39039238 0.91919655
C  1.03371007 4.33455286 0.92210331
C  0.39767344 5.53592965 0.1911574
H  0.73642744 4.31084488 1.97583491
C  2.75765933 5.98974227 0.35140804
C  1.38848548 6.67805058 0.46492932
H  -0.61609615 5.73508422 0.55092696
H  0.35349114 5.31790307 -0.88201419
H  3.50864524 6.43448069 1.01027677
H  3.13837818 6.00274053 -0.67748959
H  1.24852553 7.05939861 1.48305429
H  1.27983626 7.51471878 -0.23162561
N  2.46603551 4.60127669 0.75558093
C  2.98929571 -1.2613127 1.34183754
C  3.01376406 -1.01458439 2.88099067
H  2.7555834 -2.30341954 1.11323921
C  5.02665923 -0.1569549 1.91046992
C  4.49608887 -0.76462343 3.21098242
H  2.59997865 -1.87506665 3.41317531
H  2.4105461 -0.13653096 3.12249465
H  6.10733335 -0.20722061 1.78921623
H  4.69865828 0.8788229 1.80811436
H  5.02096225 -1.70628904 3.41101169
H  4.6278111 -0.10131129 4.07187117
C  -0.95723061 -3.12898355 -2.11274517
C  -2.43825479 -3.48183132 -2.31425214
H  -0.40203545 -3.22818467 -3.05221185
C  -1.4210949 -5.34019833 -1.15441665
C  -2.42087971 -5.01749125 -2.2791532
H  -2.83893429 -3.04957788 -3.23284721
H  -3.01806849 -3.08851322 -1.47489814
H  -0.83634976 -6.24331177 -1.35252631
H  -1.91624381 -5.44992854 -0.1819523
H  -2.04918064 -5.41163818 -3.23208694
H  -3.4083488 -5.45108115 -2.09576465
C  -3.37123425 2.19447062 -2.73761144
C  -3.57965901 3.68784475 -2.41121511
H  -3.18917776 2.04984781 -3.80788065
C  -5.73381586 2.61124295 -2.19228233
C  -5.07387042 3.90749966 -2.69090062
H  -2.91656769 4.3238511 -3.00273789
H  -3.36639825 3.85384791 -1.34887672
H  -6.59293111 2.31883443 -2.80191752
H  -6.05264854 2.69124245 -1.1482375
H  -5.23867563 4.02188296 -3.76812027
H  -5.47484859 4.79240489 -2.18778328
S  3.58730162 3.70945929 1.61608144
C  4.7769568 3.24024987 0.36577992
C  6.04052993 3.83375179 0.36180087
C  4.41099267 2.26803716 -0.56849301
C  6.95978633 3.44105703 -0.61340529
H  6.29289981 4.57110481 1.11614919
C  5.33899887 1.88744722 -1.53460782
H  3.43857513 1.79778184 -0.52774974
C  6.60861258 2.47216293 -1.5571084
H  7.95059188 3.88650941 -0.62848714
H  5.071877 1.12466514 -2.25596619
H  7.32813531 2.15828026 -2.30825583
O  2.85412218 2.51348509 2.06398338
O  4.27825653 4.56861431 2.58894112
N  4.34425029 -0.94385527 0.85473681
S  5.23602346 -2.19822513 0.12730521
N  -0.54712179 -4.14515022 -1.12033063
N  -4.64941669 1.61307182 -2.30484339
S  -5.00424204 0.02013954 -2.66139381
S  1.08317793 -4.3038142 -0.78330153
C  5.37152545 -1.65864993 -1.57902202
C  6.62720575 -1.30434642 -2.0724342
C  4.22254521 -1.60491356 -2.37185152
C  6.73446119 -0.87789148 -3.3983888
H  7.49458671 -1.36299156 -1.42451114
C  4.34494495 -1.16753047 -3.69068072
H  3.26048991 -1.89689846 -1.97193635
C  5.59531527 -0.8042981 -4.20398389
H  7.70677234 -0.60393014 -3.79885686
H  3.45902222 -1.11707989 -4.31758215
H  5.68102561 -0.46730185 -5.23367119
C  -5.48675669 -0.68153791 -1.08072048
C  -4.49546138 -1.13798089 -0.21029409
C  -6.84394869 -0.78145736 -0.76581517
C  -4.8752028 -1.71924345 1.00113377
H  -3.4501774 -1.045585 -0.4738681
C  -7.21172607 -1.35155657 0.45443622
H  -7.58882559 -0.43965314 -1.47625296
C  -6.230114 -1.82239739 1.33313553
H  -4.10584517 -2.0746136 1.68098333
H  -8.263794 -1.44276244 0.71043374
H  -6.52221393 -2.27813445 2.27568278
C  1.09666492 -4.5083713 0.9940948
C  0.06912058 -3.98098937 1.77831174
C  2.20359743 -5.15165206 1.55663933
C  0.12996464 -4.15720388 3.16212714
H  -0.75612494 -3.44707243 1.32037059
C  2.26734619 -5.2837751 2.94303132
H  2.99875734 -5.51982475 0.91921398
C  1.22567103 -4.80163719 3.74230327
H  -0.68231493 -3.77560701 3.76982164
H  3.12541068 -5.77157721 3.39609792
H  1.26977003 -4.92905108 4.8210363
O  1.64415409 -5.52511824 -1.37350543
O  1.65074236 -2.99198221 -1.12835616
O  4.42953237 -3.42666147 0.15908113
O  6.59186889 -2.19318091 0.69716027
O  -3.73080148 -0.58428862 -3.07546584
O  -6.18982732 -0.03750142 -3.52757541
C  -1.99332453 0.26878391 1.94363543
C  -1.60528531 -0.71280734 2.97762365
O  -2.05070838 -1.84953065 3.01830161
O  -0.72673466 -0.18344725 3.82985188
C  -0.18296903 -1.05149372 4.84291562
H  -0.98426574 -1.57283411 5.37395347
H  0.4899093 -1.77441997 4.38072356
H  0.36697909 -0.3959481 5.5174422
C  -3.54012331 2.10671469 1.47471443
H  -2.73424985 2.63865165 0.98279955
C  -3.22310229 0.92608913 2.11170503
H  -3.95452194 0.47870493 2.78545568
C  -4.8429891 2.73165205 1.44555447
C  -4.94641468 4.09900747 1.11210201
C  -6.02717979 1.98716003 1.63837884
C  -6.19085368 4.71144949 1.00071772
H  -4.03812023 4.67345745 0.94871881
C  -7.26873265 2.59793531 1.50554092
H  -5.96917657 0.92167339 1.83434636
C  -7.35528835 3.96083872 1.19559542
H  -6.25709267 5.76723466 0.75457012
H  -8.1725597 2.00879539 1.62970567
H  -8.32821515 4.43342295 1.09436041
