program: Gaussian 16
title: ch2cl2 opt TS
version: ES64L-G16RevC.01
frameworkgroup: C1[X(C25H30O10Rh2)]
method: RB3LYP
basis: GenECP
operation: Freq
keyword: #P
keyword: Geom=AllCheck
keyword: Guess=TCheck
keyword: SCRF=Check
keyword: GenChk
keyword: RB3LYP/GenECP
keyword: Freq
converged: YES YES NO YES
title: Mulliken charges:
elementType: Rh C C O C H H H O C C H H O C O Rh O C O O C O O C O C C C C C C H H H H H H H H C C C C H C H C H H H C H H H C H H H C H H H C H H H
charge: 0.388247 -0.174838 0.636399 -0.448227 -0.225104 0.183780 0.171339 0.173502 -0.470270 -0.129484 -0.157456 0.204043 0.151097 -0.504087 0.665584 -0.515938 0.473753 -0.511244 0.663563 -0.506866 -0.517256 0.668173 -0.499279 -0.517489 0.666927 -0.490894 -0.114857 -0.099670 -0.318139 -0.326457 -0.090818 -0.112811 0.153639 0.161962 0.189046 0.206320 0.219814 0.176797 0.165085 0.165004 0.161310 -0.181582 -0.205379 -0.141476 0.152303 -0.140366 0.156782 -0.132774 0.150806 0.150674 0.151436 -0.540420 0.193316 0.195248 0.184087 -0.538375 0.187517 0.196645 0.184666 -0.540212 0.191234 0.193219 0.185823 -0.538681 0.198015 0.190762 0.182530
chargesum: -0.00000
title: Mulliken charges with hydrogens summed into heavy atoms:
elementType: Rh C C O C O C C O C O Rh O C O O C O O C O C C C C C C C C C C C C C C C C
charge: 0.388247 -0.174838 0.636399 -0.448227 0.303518 -0.470270 0.021613 0.046588 -0.504087 0.665584 -0.515938 0.473753 -0.511244 0.663563 -0.506866 -0.517256 0.668173 -0.499279 -0.517489 0.666927 -0.490894 0.061940 0.120144 0.053266 0.027593 0.071145 0.040828 0.161310 -0.029279 -0.048597 0.009330 0.010308 0.018662 0.032230 0.030453 0.030065 0.032626
polarizability: 6.81770234e+02 -1.50985651e+00 5.54139516e+02 -1.12543514e+01 -1.36782679e+00 4.36564774e+02
1716.lowfreq: -196.6505 -9.2754 -3.3250 -0.0004 0.0006 0.0008 7.9725 19.1692 23.1959
frequency: -196.6504 18.0100 23.1445 29.4744 35.8570 37.0711 40.5706 44.1399 48.1438 54.0293 57.3244 59.8821 63.7311 65.8049 75.6423 79.5971 84.6182 93.5097 99.5391 117.7636 122.3719 125.5686 132.8574 134.3706 138.7736 143.6464 159.6579 165.4836 177.5853 185.2681 194.9742 206.6889 214.3263 229.2600 234.8690 239.4852 242.2483 243.7227 253.6941 268.2172 282.8068 283.7752 289.3436 290.5859 300.3147 304.3737 316.5555 325.7582 330.1881 347.5485 356.6521 359.0662 375.8445 413.0186 459.5000 506.2079 509.8977 523.5287 542.4063 568.7006 571.8543 582.7601 582.9349 588.5096 609.5449 621.2506 623.0446 624.4763 625.0893 631.4212 692.5900 695.4130 699.9883 701.4674 712.8210 719.6727 721.9757 772.9087 788.3964 793.6968 851.7531 853.6824 855.2383 882.3214 908.0562 926.9478 934.7290 942.0205 950.2996 952.2292 960.1264 964.1876 975.5740 985.4501 995.7648 1001.6563 1004.9737 1012.9766 1032.3362 1036.0742 1040.1026 1052.2983 1053.4178 1053.5089 1054.7775 1056.2866 1057.4561 1072.5055 1073.5192 1073.8224 1074.3522 1106.6221 1118.0246 1176.5562 1183.9558 1197.4330 1199.4115 1204.9170 1220.8160 1221.8004 1227.1789 1261.6272 1287.3732 1303.9569 1333.1562 1372.1320 1373.4183 1380.4278 1382.5224 1392.1245 1397.9992 1398.4021 1399.1385 1403.6458 1424.9654 1449.7702 1450.4082 1450.6186 1457.2095 1469.5402 1479.4100 1480.2201 1482.8223 1484.6421 1486.1143 1493.1405 1495.1689 1495.5162 1495.9501 1497.2506 1497.8365 1505.3025 1505.7264 1513.0914 1543.8786 1563.2767 1566.6953 1568.9824 1597.6854 1624.1934 1647.4566 1649.3355 1660.9773 1667.0766 1733.3108 2999.9745 3049.0001 3067.6379 3067.7196 3068.2415 3068.4142 3075.0144 3080.4999 3132.0865 3135.0804 3135.3729 3136.0191 3143.5017 3154.6635 3172.1160 3172.9482 3173.7122 3173.7770 3175.0392 3182.0568 3183.6180 3183.7492 3191.9735 3201.4421 3203.2806 3210.9084 3218.3334 3219.4516 3223.7627 3269.6045
redmass: 7.6758 4.9437 3.5707 4.9311 1.2313 3.9780 1.4030 1.3475 2.3753 3.9624 2.6921 2.5556 2.9067 2.4147 1.5278 4.6253 3.7470 5.2208 4.4411 4.2376 4.7559 4.1510 4.5246 4.0940 1.8223 5.0187 4.1239 7.5121 4.0328 4.9432 4.6332 8.2119 5.6519 3.7866 4.8399 6.3192 5.1486 5.8132 5.2255 2.4649 6.0057 7.9880 6.3129 4.8776 5.5992 6.7897 6.3183 4.6061 3.9130 6.0722 9.9213 9.1176 4.4243 2.9416 4.7071 3.9255 2.6797 4.2794 4.5706 4.6903 4.7828 5.1478 6.0479 5.1805 2.8779 2.9789 3.2541 3.7753 3.7125 6.4063 7.1335 7.3572 1.5371 1.5001 7.4913 7.3265 5.6482 1.7525 7.2464 1.4707 3.8554 1.2698 4.6056 1.3701 1.7567 2.2512 2.1007 2.4657 6.6610 6.5799 6.9001 7.0542 1.3572 2.0526 3.1629 1.3657 1.2754 6.0355 1.3824 1.3472 4.8625 1.4928 1.4930 1.4915 1.4910 1.9549 1.9632 1.7285 1.7318 1.7344 1.7352 1.6505 1.6809 1.6029 2.1703 1.1450 1.1037 1.0952 1.2365 1.3964 1.1692 2.9794 1.1755 2.9146 3.0236 1.8790 1.3814 1.5946 1.5961 1.4830 1.4590 1.4673 1.4636 1.3593 1.6298 3.6746 3.7356 3.7191 3.9536 1.7135 1.2183 1.2362 1.1682 1.2040 1.1587 1.0889 2.0393 1.0699 1.1006 1.0884 1.1028 1.1539 1.0546 1.0453 2.1645 4.6118 4.7339 4.5767 6.1562 4.6239 7.1601 4.7819 4.7910 4.6767 11.2214 1.0755 1.0661 1.0375 1.0367 1.0369 1.0369 1.0293 1.0941 1.1009 1.1001 1.0992 1.0996 1.0877 1.1077 1.0863 1.1051 1.1047 1.1048 1.1041 1.0865 1.1075 1.0873 1.0871 1.0908 1.0932 1.0937 1.0974 1.0923 1.0891 1.0908
irintensity: 219.9787 0.2173 0.2222 0.3695 1.6062 1.4441 0.9942 2.3192 1.0229 1.5875 3.2033 0.1451 4.2844 1.8616 0.3750 1.0004 4.4588 2.8433 0.9304 3.4076 1.1739 0.2469 0.8707 3.2442 1.8723 1.3533 2.2267 6.2420 8.8106 10.6801 3.9624 1.5103 0.5857 4.2957 2.3697 1.9008 1.2390 2.5683 0.2546 2.3829 14.2847 1.1569 17.5468 2.3006 10.5165 0.1694 0.5173 11.8966 34.0666 74.2244 87.6785 63.2933 15.0743 0.2460 57.9133 10.7721 8.6402 8.0213 62.4552 0.1117 1.5156 0.5473 3.8525 5.0316 0.6909 7.3489 35.2375 17.6480 14.4590 0.6780 131.9556 112.5791 15.5838 107.2063 0.1919 4.4600 7.5824 73.6786 13.3798 4.8736 11.4318 1.5054 15.0298 79.8540 34.1982 36.4683 0.4558 8.9150 0.7419 0.0626 0.6270 2.5398 0.6030 20.9990 0.2791 11.8600 1.4020 4.2006 15.8923 30.4153 19.3680 2.6320 0.3562 10.9940 9.0373 4.7598 11.8967 0.0300 21.7222 18.9226 2.9524 9.7205 9.2185 245.6979 499.8888 7.5597 0.3000 64.0600 33.8634 41.8083 21.7610 175.5866 13.8649 220.0345 22.6279 6.2362 2.4075 8.4618 32.6977 59.6353 94.1726 148.9496 21.5261 27.7505 17.4080 124.4911 489.9774 635.7443 20.1465 33.4859 16.4395 25.6792 10.1610 70.6572 165.3181 12.6373 35.0149 18.8689 26.2750 27.6927 22.3652 45.2217 14.9869 7.3427 11.5512 143.2477 135.9910 48.7890 1.5211 83.1100 1066.3854 409.5489 158.7841 36.9674 368.5894 35.6557 37.4381 6.3172 6.0756 6.2866 4.7704 54.3649 11.8542 7.7016 7.4043 7.6615 7.0512 35.8042 28.2569 3.1783 12.3042 6.6029 19.2455 14.6711 6.1590 20.7052 9.8312 0.3314 21.6800 47.1209 43.9683 42.4023 18.2180 3.2579 6.8651
temp: 298.150 k
press: 1.00000 atm
elementType: 45 6 6 8 6 1 1 1 8 6 6 1 1 8 6 8 45 8 6 8 8 6 8 8 6 8 6 6 6 6 6 6 1 1 1 1 1 1 1 1 6 6 6 6 1 6 1 6 1 1 1 6 1 1 1 6 1 1 1 6 1 1 1 6 1 1 1
symmnumber: 1
zpe: 1364487.3 jmol-1
zpe.correction: 0.519706 hartree
zpe.thermalcorrener: 0.560623 hartree
zpe.thermalcorrenthalpy: 0.561568 hartree
zpe.thermalcorrgfe: 0.442275 hartree
zpe.sumelectzpe: -1941.697891 hartree
zpe.sumelectthermal: -1941.656973 hartree
zpe.sumelectthermalent: -1941.656029 hartree
zpe.sumelectthermalfe: -1941.775321 hartree
dipole: 7.8742 4.9627 3.8798
dipole: 10.0838
quadrupole: -216.3781 -219.5576 -228.4613
quadrupole: -20.8901 9.6208 2.1866
quadrupole: 5.0876 1.9081 -6.9956 -20.8901 9.6208 2.1866
hfenergy: -1942.2175963 hartree
pointgroup: C01 [X(C25H30O10Rh2)]
dipole: 3.0781443 1.9982117 1.5071331 debye
polarizability: 681.8769027|-0.8122675|554.0460195|-10.1785282|-3.3727775|436.5516013 unknown
InChI: InChI=1S/C11H10O2.C6H8.4C2H3O2.2Rh/c1-13-11(12)9-5-8-10-6-3-2-4-7-10;1-2-4-6-5-3-1;4*1-2(3)4;;/h2-8H,1H3;1-4H,5-6H2;4*1H3;;/q;;4*-2;2*+4
charge 0 multiplicity 1
67 atoms
Rh -0.73101773 0.07499104 -0.0897686
C  0.86000295 1.4409324 -0.56034982
C  0.38194255 2.40492771 -1.59935985
O  -0.44800917 3.36818698 -1.15904353
C  -1.10648153 4.13260144 -2.18410637
H  -1.72970336 3.4719416 -2.79142796
H  -0.37682256 4.63830036 -2.8220726
H  -1.72075655 4.86069598 -1.6542777
O  0.65781846 2.25741642 -2.7812851
C  2.19043349 0.95577587 -0.82611225
C  2.72729797 -0.14884213 -0.24562877
H  2.10104209 -0.70746884 0.44122883
H  2.78386349 1.51726222 -1.54731659
O  -1.7757623 1.2959707 1.23224222
C  -2.86411128 0.88457616 1.75690222
O  -3.4163658 -0.24019088 1.55902298
Rh -2.53198872 -1.58881836 0.24617841
O  -1.40694883 -2.37651609 1.81122907
C  -0.28819524 -1.85194094 2.08986887
O  0.24347159 -0.84857829 1.50315273
O  -3.53235926 -0.69264732 -1.33850793
C  -3.0062465 0.30337797 -1.92257813
O  -1.88074603 0.83633095 -1.64584187
O  -1.5191169 -2.82794344 -1.07802975
C  -0.4277282 -2.42631685 -1.58727362
O  0.13476409 -1.29973592 -1.38323939
C  1.91098166 3.38066805 0.79562677
C  0.83209417 2.71137716 1.33228502
C  1.00739752 1.92972486 2.60889489
C  2.4076217 1.31411261 2.79189613
C  3.49823319 2.08783678 2.10619699
C  3.25654608 3.07714797 1.21283354
H  4.08045169 3.60414075 0.74020359
H  4.52540933 1.81767453 2.3421886
H  2.41530214 0.28372572 2.4167532
H  0.23764425 1.16461572 2.69610667
H  -0.17408979 3.02387826 1.09067522
H  1.75372434 4.11377335 0.01084516
H  0.81817419 2.65951084 3.41276897
H  2.64394872 1.2314184 3.86076961
C  4.05824908 -0.69834862 -0.46660213
C  5.05447429 -0.05115525 -1.22835
C  4.36768309 -1.94413747 0.11701923
C  6.30334972 -0.63718434 -1.40560431
H  4.85205077 0.91864268 -1.67206721
C  5.61910688 -2.53094176 -0.06198748
H  3.61048512 -2.45167682 0.71009086
C  6.59129743 -1.87940454 -0.82522966
H  7.05974247 -0.12508977 -1.99376689
H  5.83623568 -3.49297944 0.39348765
H  7.5690892 -2.33161869 -0.9651468
C  -3.77756727 0.94854435 -3.05267985
H  -4.07643683 1.9582386 -2.75049176
H  -3.13159056 1.0431105 -3.93045989
H  -4.66550018 0.36488282 -3.30002757
C  -3.55469849 1.85672065 2.68777495
H  -2.82272929 2.3039999 3.36601967
H  -3.99588391 2.6651631 2.09389004
H  -4.34217515 1.35770486 3.25476051
C  0.51504916 -2.43912464 3.22863173
H  1.51751065 -2.69712038 2.87258929
H  0.62948637 -1.68379043 4.01344942
H  0.02472281 -3.32367957 3.63733054
C  0.28739651 -3.35265084 -2.54612269
H  0.19187167 -2.95561111 -3.5628674
H  1.35298552 -3.38447582 -2.30186375
H  -0.14107565 -4.35554171 -2.50898833
