program: Gaussian 16
title: ch2cl2 opt TS
version: ES64L-G16RevC.01
frameworkgroup: C1[X(C25H30O10Rh2)]
method: RB3LYP
basis: GenECP
operation: Freq
keyword: #P
keyword: Geom=AllCheck
keyword: Guess=TCheck
keyword: SCRF=Check
keyword: GenChk
keyword: RB3LYP/GenECP
keyword: Freq
converged: YES YES YES YES
title: Mulliken charges:
elementType: Rh C C O C H H H O C C H H O C O Rh O C O O C O O C O C C C C C C H H H H H H H H C C C C H C H C H H H C H H H C H H H C H H H C H H H
charge: 0.428277 -0.332982 0.641194 -0.440102 -0.222914 0.182767 0.171229 0.174213 -0.475474 -0.071954 -0.149529 0.170570 0.178220 -0.501782 0.663039 -0.515761 0.441582 -0.511914 0.662803 -0.511109 -0.517025 0.667511 -0.503641 -0.516879 0.667749 -0.500140 -0.318582 -0.256739 -0.089314 -0.108821 -0.119475 -0.109226 0.162516 0.155550 0.168342 0.180851 0.172146 0.218243 0.209685 0.191315 0.159114 -0.192455 -0.182111 -0.139882 0.155350 -0.141421 0.162013 -0.129621 0.153706 0.153842 0.154677 -0.537267 0.183571 0.195730 0.184106 -0.538349 0.187145 0.197365 0.182644 -0.538033 0.197857 0.186786 0.182897 -0.537380 0.192505 0.188216 0.184560
chargesum: -0.00000
title: Mulliken charges with hydrogens summed into heavy atoms:
elementType: Rh C C O C O C C O C O Rh O C O O C O O C O C C C C C C C C C C C C C C C C
charge: 0.428277 -0.332982 0.641194 -0.440102 0.305295 -0.475474 0.106265 0.021041 -0.501782 0.663039 -0.515761 0.441582 -0.511914 0.662803 -0.511109 -0.517025 0.667511 -0.503641 -0.516879 0.667749 -0.500140 0.082417 0.142355 0.082832 0.059521 0.036075 0.053290 0.159114 -0.037105 -0.020099 0.013823 0.012421 0.025056 0.026140 0.028805 0.029507 0.027901
chargesum: 0.00000
polarizability: 7.63317712e+02 -1.16688654e+01 5.66291364e+02 -2.61039370e+01 7.29041617e+00 4.21511337e+02
1716.lowfreq: -905.3464 -0.0007 -0.0006 0.0004 2.8656 5.7524 8.1681 15.6228 22.4900
frequency: -905.3463 14.5158 22.4373 23.8403 26.8198 28.3310 35.1447 40.1126 40.4979 42.6238 43.1260 51.7628 58.3031 60.7046 63.2315 65.4359 73.5801 80.8223 88.6225 96.2805 109.8114 120.5275 128.3544 133.5789 141.6914 145.5911 155.8978 157.6697 163.6569 187.0214 191.8683 203.5757 209.1465 215.3373 235.7318 237.5695 238.5494 243.7531 246.9999 275.0412 282.7904 286.1598 289.4202 294.3699 301.1011 304.3476 310.5801 316.8430 334.6220 355.2915 358.7366 364.5510 411.0716 418.7045 438.2809 492.8498 515.6957 523.4020 571.2679 571.9680 583.5528 585.8656 589.4629 591.6084 608.1559 620.2467 621.4038 623.6867 628.3176 630.9639 654.6651 693.1493 695.6397 696.8993 701.3743 712.6832 719.5047 755.0093 777.2904 814.7116 830.0207 841.6957 854.9677 866.7961 884.3296 912.4852 937.0662 948.8880 949.4244 958.7083 960.4926 962.9228 977.9962 978.3601 990.1114 990.3976 1001.0744 1006.8245 1011.3727 1012.9278 1014.5605 1023.8280 1043.9863 1052.0295 1052.9851 1053.8123 1054.2745 1057.2684 1072.0250 1072.9619 1073.2549 1073.4723 1119.6423 1120.4418 1180.5080 1183.3203 1192.9576 1200.3854 1202.1775 1214.0513 1221.7332 1225.3272 1237.7563 1261.2147 1332.0664 1344.4573 1359.2906 1371.1484 1375.9670 1383.1306 1392.8802 1396.3443 1397.3373 1397.6889 1401.3129 1410.6293 1446.8250 1447.5648 1448.2755 1449.1349 1454.8330 1455.3414 1477.8559 1478.6742 1480.9915 1483.4520 1484.1919 1490.7843 1496.0673 1497.4948 1499.5041 1499.9359 1500.5153 1505.7284 1514.2828 1543.7149 1564.3951 1565.2525 1592.6004 1595.5115 1622.2868 1640.1933 1648.5991 1658.0144 1687.8982 1738.3574 2961.9615 3066.4347 3066.8153 3067.3908 3067.6797 3071.5503 3132.6852 3135.8240 3136.3119 3137.2926 3138.0578 3147.7561 3172.0873 3172.3602 3172.5033 3174.0709 3182.2912 3186.9967 3187.9020 3188.9210 3191.3731 3194.2545 3198.4060 3201.8143 3204.5089 3212.6101 3213.7047 3220.5067 3222.8503
redmass: 1.5480 4.6275 5.3831 3.6369 1.6972 2.4613 1.3940 2.1163 1.2376 1.6937 2.2271 4.9236 2.3241 4.2967 2.4266 2.3540 4.9352 7.8069 5.8489 4.5089 4.7039 4.0088 4.3289 4.2632 4.8467 2.2792 2.9817 5.6062 4.2393 4.3879 5.3029 5.7185 13.9894 7.0243 7.1302 6.8339 6.6193 6.2230 2.5181 4.6232 7.6857 6.9897 4.4334 4.5883 8.0511 6.8299 1.9922 6.2579 10.4410 8.7969 9.8627 6.3943 2.9051 2.7944 4.6589 3.5135 5.0126 2.6668 4.6767 4.7213 5.0300 4.9170 5.1441 3.5030 2.8861 2.9832 3.0392 3.0140 5.6283 6.1522 5.2993 5.9377 7.0391 1.9342 1.4243 7.4841 7.3719 2.2622 2.3669 1.5538 1.6736 2.5426 1.3530 3.4053 3.1618 3.6049 1.5021 6.2437 6.8260 7.0043 3.1672 5.8996 1.4956 1.5394 1.7020 1.7847 1.3053 1.4585 1.8120 3.9286 2.2514 4.0815 1.6605 1.4910 1.4803 1.4761 1.4781 2.2187 1.7327 1.7357 1.7355 1.7390 1.6322 1.3898 1.8099 1.5735 1.2403 1.1035 1.1185 1.1179 1.2606 1.4691 1.4767 2.0608 2.7067 1.6914 1.6794 1.3650 1.6594 1.5094 1.7384 1.5121 1.5048 1.5008 1.4349 1.6041 2.0886 3.5816 3.3985 2.6106 1.7165 1.9039 1.1845 1.2016 1.1429 1.3855 1.3919 1.2719 1.0569 2.1020 1.0962 1.1013 1.1224 1.0481 1.0479 2.1566 4.7927 4.7088 5.1152 6.0858 4.2950 5.0239 5.9195 5.0774 4.9622 10.7247 1.0740 1.0383 1.0386 1.0379 1.0366 1.0297 1.1009 1.0978 1.0982 1.0970 1.0850 1.1079 1.1054 1.1059 1.1053 1.1042 1.1069 1.0892 1.0869 1.0886 1.0856 1.0872 1.0862 1.0887 1.0909 1.0958 1.0936 1.0974 1.0970
irintensity: 5957.7041 0.5569 0.6454 0.1004 1.9082 0.4702 0.6530 1.1846 1.6529 1.2348 0.7461 2.5000 0.3446 0.5111 1.4713 1.1082 3.8368 1.8440 3.2959 5.0862 1.5191 0.0036 0.1640 0.7465 5.6562 2.3231 0.6742 0.0930 5.4868 2.9623 6.1101 1.4236 0.3108 0.1576 0.2932 0.9274 0.6931 0.8070 12.8726 74.9761 2.0972 19.3972 1.4529 4.2047 3.6497 0.0728 5.7908 1.0756 59.6621 62.4470 82.9935 49.9008 2.3993 14.7803 11.6850 36.9479 46.2661 20.6267 0.4515 0.6286 0.0828 1.5801 2.3570 7.8317 2.0040 6.3771 14.6309 9.7407 60.5314 14.9494 7.6812 174.1365 111.5202 58.0573 20.9043 2.0921 4.7260 159.0399 14.3855 5.4005 35.5236 105.2615 11.4056 16.9774 2.0193 41.9917 7.5413 2.9470 0.4690 0.6803 94.7637 17.7660 3.4570 15.5808 19.8603 23.8996 8.6474 27.3994 4.2548 13.6801 9.2670 21.2771 65.4632 4.5510 1.1090 6.0855 8.5414 1.2680 2.8704 22.2570 21.6601 0.0102 17.9829 9.0694 289.5479 189.2911 82.6205 0.6035 54.8180 13.4501 68.2010 99.4547 159.0462 75.9739 10.1961 134.6820 148.3381 16.3829 56.2993 69.9858 9.2013 134.3640 146.8767 15.0993 154.5165 337.5593 169.5952 220.4908 545.7753 308.2447 3.6322 56.8638 0.2597 4.8696 14.0747 183.3530 88.4060 28.8696 11.3977 24.1350 30.4527 30.6602 20.8629 9.6502 11.3456 9.9507 0.1033 5.6435 183.3270 13.2339 281.2473 1084.2677 527.3909 19.5215 15.5408 487.0115 21.0596 6.7953 4.7305 8.5561 4.2447 49.5497 7.6962 9.1163 9.3611 8.7574 0.8539 31.8090 11.9116 8.8233 18.3090 14.0982 19.0006 11.9435 5.2192 6.0404 2.2071 3.3059 16.3682 10.9084 17.9746 27.6436 48.0172 39.7033 21.9338
temp: 298.150 k
press: 1.00000 atm
elementType: 45 6 6 8 6 1 1 1 8 6 6 1 1 8 6 8 45 8 6 8 8 6 8 8 6 8 6 6 6 6 6 6 1 1 1 1 1 1 1 1 6 6 6 6 1 6 1 6 1 1 1 6 1 1 1 6 1 1 1 6 1 1 1 6 1 1 1
symmnumber: 1
zpe: 1349280.6 jmol-1
zpe.correction: 0.513914 hartree
zpe.thermalcorrener: 0.555341 hartree
zpe.thermalcorrenthalpy: 0.556285 hartree
zpe.thermalcorrgfe: 0.433429 hartree
zpe.sumelectzpe: -1941.692515 hartree
zpe.sumelectthermal: -1941.651088 hartree
zpe.sumelectthermalent: -1941.650144 hartree
zpe.sumelectthermalfe: -1941.773000 hartree
dipole: 11.1034 5.4314 3.3884
dipole: 12.8166
quadrupole: -222.9905 -203.8284 -230.8113
quadrupole: -12.7619 13.2871 -1.3701
quadrupole: -3.7804 15.3817 -11.6013 -12.7619 13.2871 -1.3701
hfenergy: -1942.2064286 hartree
pointgroup: C01 [X(C25H30O10Rh2)]
dipole: -4.3882851 2.0708102 -1.3715052 debye
polarizability: 762.8672815|11.9169354|565.8455992|-28.3799044|-11.882393|422.4075325 unknown
InChI: InChI=1S/C17H18O2.4C2H3O2.2Rh/c1-19-17(18)16(20-15-10-6-3-7-11-15)13-12-14-8-4-2-5-9-14;4*1-2(3)4;;/h2-10,12-13,15H,11H2,1H3;4*1H3;;/q;4*-2;2*+4
charge 0 multiplicity 1
67 atoms
Rh 0.86429415 -0.03645382 0.13002237
C  -1.07161303 0.7055432 0.49001739
C  -1.13140057 1.67089026 1.61510026
O  -0.56729291 2.85915951 1.3206342
C  -0.4487506 3.781489 2.41671355
H  0.19411761 3.36215948 3.19515424
H  -1.43091542 4.00791545 2.84088453
H  0.00072009 4.67965149 1.99312366
O  -1.54241223 1.39003226 2.73179645
C  -2.1424716 -0.22710538 0.27634469
C  -3.39993067 -0.12125908 0.79277535
H  -3.61936934 0.73486829 1.42611915
H  -1.91295115 -1.03704075 -0.41074944
O  1.53096175 1.71922203 -0.75829291
C  2.71980538 1.77698523 -1.22005411
O  3.58128777 0.84576662 -1.20432779
Rh 3.08245891 -0.99632796 -0.36539416
O  2.27888497 -1.59812755 -2.19930408
C  1.07070208 -1.33494376 -2.47604387
O  0.23802833 -0.71507017 -1.72855637
O  3.67779043 -0.29748457 1.50537271
C  2.84790033 0.32450065 2.23756673
O  1.63125712 0.58856315 1.9535002
O  2.40125383 -2.7604312 0.50740488
C  1.2211287 -2.81195703 0.9718954
O  0.35818635 -1.87091711 0.96002086
C  -1.58102222 3.48511271 -1.46329315
C  -1.37637098 2.02886651 -1.81557935
C  -2.54662626 1.30478404 -2.2696704
C  -3.78296806 1.70186681 -1.85075619
C  -3.95718949 2.90055199 -1.05045644
C  -2.9247925 3.74900274 -0.8518305
H  -3.06192507 4.67046243 -0.29235084
H  -4.93922625 3.11071199 -0.63629898
H  -4.66126211 1.11873723 -2.11339428
H  -1.09182681 1.44088636 -0.69398337
H  -2.41362575 0.37341345 -2.81074385
H  -0.43503461 1.79985159 -2.31145112
H  -0.7729446 3.83623205 -0.81878599
H  -1.50329226 4.07269685 -2.39794999
C  -4.49901187 -1.05749002 0.60435187
C  -5.76958492 -0.71200617 1.10911993
C  -4.35781329 -2.28867317 -0.07224799
C  -6.86444746 -1.55535171 0.9332656
H  -5.890685 0.23021477 1.63772775
C  -5.45115607 -3.13067664 -0.24359536
H  -3.38733959 -2.59087732 -0.4529996
C  -6.70875983 -2.76750246 0.25544816
H  -7.83596014 -1.27033775 1.32660887
H  -5.32598364 -4.07642609 -0.76305695
H  -7.55910144 -3.42983289 0.12042734
C  3.13186586 3.10541719 -1.8168029
H  2.30444488 3.53250389 -2.38942953
H  3.37001982 3.79985699 -1.00278105
H  4.01285715 2.98798134 -2.45019557
C  3.3222575 0.78485295 3.59900348
H  2.94507138 1.78963669 3.80705201
H  2.91557709 0.11099851 4.36179428
H  4.41207111 0.76853961 3.65445226
C  0.78624192 -4.1006526 1.63548829
H  0.86997117 -3.98298113 2.72217154
H  -0.26018589 -4.31139657 1.40119257
H  1.42258668 -4.92970572 1.32081179
C  0.53064409 -1.79431719 -3.81279657
H  -0.26149759 -2.53224873 -3.64641847
H  0.08455659 -0.94433512 -4.33854092
H  1.3209302 -2.23694966 -4.42069927
