program: Gaussian 16
title: ch2cl2 opt TS
version: ES64L-G16RevC.01
method: RB3LYP
basis: GenECP
operation: Freq
keyword: #P
keyword: Geom=AllCheck
keyword: Guess=TCheck
keyword: SCRF=Check
keyword: GenChk
keyword: RB3LYP/GenECP
keyword: Freq
converged: YES YES YES YES
title: Mulliken charges:
elementType: Rh C C O C H H H O C C H H O C O Rh O C O O C O O C O C C C C C C H H H H H H H H C C C C H C H C H H H C H H H C H H H C H H H C H H H
charge: 0.413105 -0.339616 0.645553 -0.438402 -0.224589 0.184217 0.175670 0.171972 -0.483560 -0.069278 -0.167803 0.165534 0.181325 -0.506578 0.666134 -0.513642 0.461412 -0.511714 0.663254 -0.508541 -0.516869 0.668141 -0.502698 -0.516801 0.668752 -0.498069 -0.260566 -0.335722 -0.100350 -0.116815 -0.111748 -0.086780 0.169162 0.167799 0.155213 0.219921 0.162141 0.193557 0.197316 0.218538 0.162133 -0.193549 -0.182217 -0.140343 0.153882 -0.143269 0.159479 -0.130764 0.153012 0.152778 0.153555 -0.537363 0.186686 0.196211 0.183912 -0.538779 0.195629 0.188524 0.183520 -0.538189 0.197401 0.187525 0.183442 -0.538056 0.186177 0.193710 0.186378
chargesum: -0.00000
title: Mulliken charges with hydrogens summed into heavy atoms:
elementType: Rh C C O C O C C O C O Rh O C O O C O O C O C C C C C C C C C C C C C C C C
charge: 0.413105 -0.339616 0.645553 -0.438402 0.307270 -0.483560 0.112047 -0.002269 -0.506578 0.666134 -0.513642 0.461412 -0.511714 0.663254 -0.508541 -0.516869 0.668141 -0.502698 -0.516801 0.668752 -0.498069 0.155288 0.077755 0.061791 0.038398 0.056051 0.082383 0.162133 -0.039667 -0.022739 0.012669 0.009508 0.022791 0.029446 0.028894 0.030179 0.028209
polarizability: 7.42778693e+02 -2.84762673e+01 4.81896106e+02 -1.32108014e+01 5.23447510e-01 4.72428463e+02
1716.lowfreq: -734.8690 -16.5205 -8.0607 0.0002 0.0003 0.0007 7.5100 17.9554 22.8532
frequency: -734.8690 15.5009 22.3569 28.5112 30.5712 37.4342 42.6924 43.5687 45.9209 53.9525 56.4679 62.7966 63.4032 64.0390 68.8112 72.2375 84.9826 89.7967 95.5710 106.9249 114.7127 117.5460 127.2777 129.1529 138.7429 147.1956 152.1584 162.4742 172.9610 190.2958 196.3255 200.5855 207.5809 212.0529 231.6401 232.2522 235.9859 238.3661 251.5148 271.7971 282.0145 285.4656 287.5971 290.6722 299.0287 303.3956 307.2621 317.0112 334.5681 356.2701 358.0357 371.8138 411.8632 418.3016 443.4238 494.3305 511.1098 522.8967 569.5596 570.8525 581.9143 586.3456 587.6918 591.8034 607.6532 619.3428 621.5985 623.1830 630.6243 651.9687 663.5242 686.9842 693.2569 695.7681 700.2106 711.6672 719.2538 754.5122 785.2237 816.5875 825.6204 848.9292 854.7788 867.6967 890.6618 908.2559 919.4153 940.1649 948.8428 950.2302 958.4964 963.1709 973.8275 976.3676 988.6756 992.0285 992.2943 1001.9899 1008.2503 1009.7031 1012.5426 1028.7678 1052.5962 1053.3598 1053.4542 1054.4027 1057.6581 1072.1086 1073.0890 1073.5432 1074.1353 1081.2635 1117.2106 1119.0531 1171.6111 1179.8450 1197.4382 1199.7146 1201.0543 1217.1594 1219.3544 1222.2082 1248.2078 1286.9930 1328.6291 1338.4766 1345.1538 1363.3228 1370.0839 1377.2155 1387.7700 1396.9610 1397.0423 1397.8046 1402.1935 1408.8384 1445.7592 1447.5958 1447.9890 1448.8307 1454.7305 1461.9254 1478.2495 1478.8121 1481.6194 1483.9776 1484.7981 1488.7272 1496.6461 1498.8340 1499.2946 1499.6325 1500.9925 1505.4548 1514.6945 1543.9141 1564.6108 1565.3552 1592.0299 1595.7525 1623.2504 1640.9579 1648.5049 1656.2707 1689.5548 1755.9010 2968.9263 3064.1022 3066.2715 3067.1771 3068.3147 3074.4327 3134.1117 3135.7285 3136.3089 3136.5778 3137.0466 3152.8991 3171.7029 3172.9810 3173.7131 3174.1252 3180.4099 3185.5878 3187.4136 3193.3448 3194.0236 3195.1624 3200.2063 3202.9601 3205.0009 3215.4811 3216.3082 3223.0142 3224.7745
redmass: 1.7222 5.3583 4.8202 1.0690 4.2089 1.3549 1.3970 4.4827 3.4656 3.3110 4.0375 2.4890 2.9665 2.3225 1.2721 4.2681 3.9705 6.2398 5.4646 4.7925 4.3792 4.5334 5.2818 4.8809 4.1934 2.0621 2.5010 7.0527 4.0780 5.1929 4.5968 7.7855 8.0808 6.6283 6.6248 6.9435 6.5230 6.5586 3.1784 3.7536 5.7551 6.8573 4.3878 2.7943 9.5164 6.6220 2.6969 6.4489 9.5241 9.2326 9.6979 4.9987 2.8988 3.0029 4.2596 5.3461 3.5300 2.4148 4.7131 4.7076 5.0127 5.0670 5.1794 3.6354 2.8889 2.9884 3.0342 3.0124 6.4556 6.4868 4.3934 1.7444 6.7117 5.8987 1.6934 7.4684 7.4009 1.7336 2.1061 3.3685 1.5687 1.6199 1.8312 4.4500 2.5246 3.8337 2.0494 1.6972 6.8063 6.7206 6.9979 7.1303 1.6853 1.3649 1.7170 1.3261 1.6909 1.6367 2.6369 1.2698 5.6273 3.3542 1.4823 1.4806 1.4818 1.4750 2.2147 1.7326 1.7352 1.7370 1.7382 1.8111 1.3565 1.6554 1.8985 1.2940 1.3900 1.1040 1.0484 1.2518 1.3818 1.1611 2.5290 1.3922 2.6013 2.2691 1.7319 1.6273 1.3562 1.7530 1.5643 1.5119 1.5110 1.4969 1.3927 1.4517 1.8458 2.9167 2.9664 3.4384 3.3337 1.3603 1.1837 1.1962 1.1415 1.1509 1.2062 1.7770 1.0689 1.8308 1.1021 1.1633 1.1216 1.0490 1.0465 2.1435 4.7048 4.8323 4.7050 6.0398 4.2588 4.8626 5.9877 5.1869 4.8904 10.9275 1.0744 1.0402 1.0386 1.0380 1.0366 1.0293 1.1006 1.0938 1.0981 1.0851 1.0970 1.1080 1.1060 1.1053 1.1045 1.1057 1.0898 1.1071 1.0872 1.0869 1.0874 1.0858 1.0876 1.0888 1.0914 1.0947 1.0956 1.0948 1.0968
irintensity: 3950.1405 0.1711 0.2829 0.7936 0.0790 1.7867 1.5153 0.4770 0.1789 0.7066 0.4741 0.6260 3.5786 2.3906 0.3751 3.0783 1.3509 1.8453 6.3784 2.6423 2.2199 2.1926 0.7014 0.7332 1.4169 2.2934 0.6286 0.7480 9.9066 7.4367 10.9017 0.1374 0.5517 0.6120 0.5729 1.9074 0.4829 0.7334 4.3092 93.1069 2.6234 3.5649 0.8082 13.5417 5.2976 0.0749 3.1949 2.0057 55.2867 74.1663 79.7440 38.3529 0.4286 6.8196 6.8360 57.9007 29.1708 7.3981 0.2472 0.1284 0.0400 8.5368 4.5410 19.9774 3.4247 2.5174 13.0117 16.7323 0.2449 17.9083 4.8317 142.7840 92.8578 93.3531 0.3467 0.3937 4.5579 235.0005 12.6074 4.2828 29.3482 36.6153 54.9620 43.3040 29.4351 17.5537 142.8996 33.4074 0.3935 0.7731 0.9888 2.6746 11.1512 0.2995 4.1286 4.3083 36.4302 12.1427 10.1335 0.4153 4.0900 10.7895 1.3247 0.7604 6.6742 10.7768 5.6012 7.1899 14.7091 11.3169 11.5341 126.4750 16.0474 8.5219 254.8180 13.8934 212.3851 0.4692 13.0362 15.0320 163.7641 24.1278 126.5698 387.4976 20.8081 60.1716 192.5854 101.3773 9.3056 21.2069 44.6142 131.1735 149.8755 3.2860 65.9699 160.5466 109.1310 404.3924 457.3655 284.5236 67.4124 44.5135 8.1901 1.2364 17.3048 217.2452 23.6885 42.9454 15.7314 72.3821 17.0902 9.4570 38.6948 11.1068 4.6660 16.0285 2.1912 5.4561 175.7019 17.7326 164.9365 922.4306 554.7665 4.9775 23.3443 435.0305 16.8113 4.7763 6.1255 5.6924 5.6308 48.1427 8.0940 7.8351 8.1998 1.6688 9.3243 30.7447 11.2262 12.4207 13.0915 15.2714 6.8684 18.9316 8.4767 3.9197 4.1252 1.1244 24.4214 10.5899 26.1361 47.4840 25.4010 23.1419 18.3442
temp: 298.150 k
press: 1.00000 atm
elementType: 45 6 6 8 6 1 1 1 8 6 6 1 1 8 6 8 45 8 6 8 8 6 8 8 6 8 6 6 6 6 6 6 1 1 1 1 1 1 1 1 6 6 6 6 1 6 1 6 1 1 1 6 1 1 1 6 1 1 1 6 1 1 1 6 1 1 1
symmnumber: 1
zpe: 1350184.2 jmol-1
zpe.correction: 0.514258 hartree
zpe.thermalcorrener: 0.555435 hartree
zpe.thermalcorrenthalpy: 0.556379 hartree
zpe.thermalcorrgfe: 0.435859 hartree
zpe.sumelectzpe: -1941.698345 hartree
zpe.sumelectthermal: -1941.657168 hartree
zpe.sumelectthermalent: -1941.656224 hartree
zpe.sumelectthermalfe: -1941.776744 hartree
dipole: -11.4216 -1.7056 -2.3888
dipole: 11.7928
quadrupole: -220.9110 -209.2065 -231.0182
quadrupole: 9.3876 -12.7478 2.8955
quadrupole: -0.5324 11.1721 -10.6396 9.3876 -12.7478 2.8955
hfenergy: -1942.2126031 hartree
pointgroup: C01 [X(C25H30O10Rh2)]
dipole: -4.4936179 -0.6710223 -0.9398138 debye
polarizability: 742.778693|-28.4762673|481.8961057|-13.2108014|0.5234475|472.4284634 unknown
InChI: InChI=1S/C17H18O2.4C2H3O2.2Rh/c1-19-17(18)16(20-15-10-6-3-7-11-15)13-12-14-8-4-2-5-9-14;4*1-2(3)4;;/h2-10,12-13,15H,11H2,1H3;4*1H3;;/q;4*-2;2*+4
charge 0 multiplicity 1
67 atoms
Rh 0.88604979 0.14823428 -0.02418683
C  -1.01624957 0.66748303 -0.74126226
C  -0.99377766 1.87911581 -1.6077766
O  -1.10458956 2.99790837 -0.85936716
C  -0.8217765 4.23188467 -1.54595442
H  0.20763365 4.22371229 -1.91368168
H  -0.95540749 5.01637398 -0.80130129
H  -1.50924462 4.37564825 -2.38356634
O  -0.81463576 1.89407849 -2.81485139
C  -2.15033135 0.37741793 0.08393147
C  -3.3816809 0.95050362 -0.0654333
H  -3.48880348 1.75531737 -0.78967583
H  -2.01234315 -0.43877333 0.78730802
O  1.46270091 -0.77060653 -1.79431294
C  2.61602143 -1.3156178 -1.87435999
O  3.49105718 -1.36092154 -0.95844407
Rh 3.08692984 -0.4885008 0.8935083
O  2.18706858 -2.26929272 1.51363216
C  0.95739538 -2.46606912 1.27852442
O  0.15785454 -1.65864227 0.69192904
O  3.7892818 1.338779 0.18178028
C  3.00086243 2.11736899 -0.43714572
O  1.7623692 1.91536461 -0.67226619
O  2.50029266 0.42762489 2.66675178
C  1.35554443 0.97147999 2.73974982
O  0.47522999 1.01750538 1.8161578
C  -1.50124525 -1.07535706 -2.65766517
C  -1.26333525 -2.45985225 -2.08533278
C  -2.37280744 -2.940178 -1.19992983
C  -3.60195069 -2.38339228 -1.24854197
C  -3.87235688 -1.27660457 -2.14813094
C  -2.8786487 -0.68443577 -2.87398148
H  -3.08740513 0.16878601 -3.51117622
H  -4.89700816 -0.92980974 -2.2488826
H  -4.40955768 -2.75218607 -0.62344742
H  -0.3041916 -2.49039148 -1.56323146
H  -2.17050379 -3.78576506 -0.54829036
H  -1.1648087 -3.16102272 -2.93508038
H  -1.10973078 -0.31401772 -1.69909984
H  -0.77705202 -0.75222448 -3.40188055
C  -4.58735396 0.62094609 0.684196
C  -5.75026386 1.38819101 0.46870022
C  -4.65463851 -0.45839238 1.5915439
C  -6.93648044 1.09576476 1.13794013
H  -5.71432026 2.21888444 -0.23182757
C  -5.84134811 -0.75042673 2.25687598
H  -3.77912427 -1.07382487 1.76955753
C  -6.98600981 0.0247084 2.03480174
H  -7.82115379 1.70039286 0.96001812
H  -5.87726213 -1.58544517 2.95078771
H  -7.90983673 -0.20697129 2.55716435
C  2.94611332 -1.95325022 -3.20588152
H  2.12969569 -2.61641131 -3.50741976
H  3.03318261 -1.16972558 -3.96645563
H  3.88227798 -2.51053411 -3.14882907
C  3.5726315 3.40828538 -0.98143278
H  3.7141701 3.30319553 -2.06324297
H  2.86933096 4.22849359 -0.81494861
H  4.53446726 3.63157183 -0.51671987
C  0.99420521 1.6659258 4.0348649
H  1.15535675 2.74346928 3.91332854
H  -0.06223784 1.50856269 4.26590767
H  1.62173593 1.30628382 4.85230189
C  0.36446288 -3.79642534 1.68793085
H  -0.66703878 -3.66395106 2.02308501
H  0.35311882 -4.45757579 0.8129814
H  0.96468775 -4.26301128 2.47102976
