program: Gaussian 16
title: ch2cl2 opt TS
version: ES64L-G16RevC.01
frameworkgroup: C1[X(C19H22O10Rh2)]
method: RB3LYP
basis: GenECP
operation: Freq
keyword: #P
keyword: Geom=AllCheck
keyword: Guess=TCheck
keyword: SCRF=Check
keyword: GenChk
keyword: RB3LYP/GenECP
keyword: Freq
converged: YES YES NO NO
title: Mulliken charges:
elementType: Rh C C O C H H H O C C H H O C O Rh O C O O C O O C O C H H H C H H H C H H H C H H H C C C C H C H C H H H
charge: 0.475140 -0.084308 0.558890 -0.422637 -0.229271 0.178579 0.187285 0.181840 -0.457163 -0.198854 -0.104628 0.225225 0.177124 -0.496301 0.666715 -0.513734 0.461884 -0.510512 0.666820 -0.506759 -0.514064 0.666518 -0.495711 -0.510520 0.667093 -0.508845 -0.536211 0.193212 0.197067 0.184418 -0.535928 0.188984 0.198866 0.185965 -0.536321 0.195806 0.191729 0.184634 -0.536184 0.197857 0.189113 0.186330 0.153867 -0.156275 -0.177850 -0.137228 0.172199 -0.134849 0.176649 -0.113381 0.168313 0.167971 0.171439
chargesum: -0.00000
title: Mulliken charges with hydrogens summed into heavy atoms:
elementType: Rh C C O C O C C O C O Rh O C O O C O O C O C C C C C C C C C C
charge: 0.475140 -0.084308 0.558890 -0.422637 0.318433 -0.457163 -0.021730 0.120597 -0.496301 0.666715 -0.513734 0.461884 -0.510512 0.666820 -0.506759 -0.514064 0.666518 -0.495711 -0.510520 0.667093 -0.508845 0.038487 0.037887 0.035848 0.037116 0.153867 0.015925 -0.001201 0.031086 0.033123 0.058058
polarizability: 7.06983376e+02 -1.51626630e+00 4.42743291e+02 -6.13088195e-01 1.62333019e+01 2.90079243e+02
1716.lowfreq: -7.0623 -1.9802 -0.0006 -0.0004 0.0004 6.0043 10.8047 16.6240 23.1297
frequency: -4.5564 15.7851 22.8977 26.3540 31.8309 36.0314 38.4759 46.1903 48.2114 60.0305 63.2577 66.6886 71.0147 85.8106 96.6298 99.0340 121.3884 129.2270 133.6054 134.2833 138.6576 150.6817 159.2326 177.9920 194.4008 202.5817 205.8316 214.8449 232.5240 236.8813 237.2998 242.1162 250.2221 276.5694 285.5552 286.3764 296.1924 299.9322 308.4374 315.0049 320.9800 329.2389 359.2846 361.9235 392.6319 408.4050 477.7872 482.5880 571.4158 573.1449 584.0663 589.1997 606.3266 608.9283 621.4501 622.6458 623.4683 626.3741 643.1353 687.6998 693.3261 696.1344 710.8337 717.7178 725.0854 778.4888 806.2246 851.6560 859.5990 911.7712 932.8563 949.4628 950.7971 952.6367 959.5779 963.3304 984.5531 993.6273 1011.8317 1022.0439 1045.4189 1052.6182 1052.9324 1053.3791 1053.5941 1054.1363 1072.5658 1073.6498 1073.7947 1074.4140 1123.1929 1178.9598 1203.5987 1212.6992 1219.6947 1235.0671 1273.3626 1335.1667 1341.3784 1370.3138 1381.1275 1396.8188 1397.2562 1398.2321 1402.8491 1432.5212 1447.4242 1447.9796 1448.2048 1455.4098 1477.8769 1478.2120 1481.4768 1484.3254 1489.4679 1495.3520 1495.6865 1495.8793 1496.2229 1498.8625 1506.7125 1513.0678 1542.2279 1563.1673 1563.9796 1595.3445 1596.2375 1623.7348 1644.3277 1652.9944 1753.8755 3069.2299 3069.4858 3069.6417 3069.7822 3076.4235 3134.8985 3135.9094 3136.6927 3137.9631 3144.0817 3154.4672 3174.7687 3175.1257 3175.4609 3175.6455 3192.9466 3196.9474 3204.6660 3214.3941 3223.3973 3229.8250 3256.9701
redmass: 1.1385 4.8747 3.5189 1.2124 4.1162 5.3657 1.2175 3.2584 1.6139 2.1458 2.5858 2.1498 5.3174 4.8731 5.1772 5.4114 3.6945 3.4976 2.2585 2.9080 2.8847 11.4954 6.9755 6.2942 5.7783 4.5236 13.9201 6.7511 6.8440 6.2341 6.3649 6.6416 7.4186 5.6473 6.6363 5.3411 10.8910 3.2294 5.5449 5.9987 4.8415 8.7067 9.7751 9.7735 6.6166 2.8237 3.0811 5.2226 4.7339 4.7902 5.0606 5.1989 6.2741 2.8797 2.9660 3.0250 3.0197 6.4934 6.5398 1.9569 7.7918 5.6711 7.5674 7.4928 7.1041 1.7480 7.4401 1.2782 4.9139 1.9942 4.3325 3.0061 5.1521 1.9253 6.5203 7.0995 1.3346 1.3689 6.0336 1.3171 6.8001 1.4936 1.5272 1.4917 1.6405 1.9193 1.7291 1.7327 1.7343 1.7374 1.6747 1.2715 1.1030 1.6676 1.3510 2.2120 3.5936 1.8955 1.6149 1.9674 2.4642 1.5233 1.5104 1.4892 1.3810 2.6965 3.7140 3.6902 3.7318 4.1398 1.2233 1.2192 1.1582 1.1368 1.3294 1.0627 1.0657 1.0729 1.0919 2.1215 1.0492 1.0482 2.2153 4.5262 4.5516 5.9488 2.8328 4.4265 7.5618 5.2232 11.6831 1.0365 1.0368 1.0366 1.0370 1.0298 1.1009 1.1005 1.1001 1.0994 1.0884 1.1084 1.1052 1.1048 1.1046 1.1044 1.1070 1.0884 1.0882 1.0908 1.0949 1.0970 1.0887
irintensity: 1.6211 0.2320 0.8194 1.2314 0.4637 0.8181 1.7042 1.8200 2.4969 0.5776 1.3550 0.3118 0.6822 0.9698 1.6736 3.4127 0.0011 0.1205 0.5098 1.4095 0.3568 0.1952 3.7873 9.1273 1.3814 4.4270 0.5796 0.4040 0.0216 0.1199 0.1508 1.4036 4.0559 1.9822 2.9258 1.5164 7.1217 2.9825 2.1099 0.9175 69.7872 34.4464 85.1134 93.9892 5.4769 0.0396 19.8342 78.5284 0.3162 0.2275 0.0474 2.9680 24.1049 1.1408 2.1068 15.6478 16.6244 0.7594 21.8892 3.1872 133.5140 169.4875 0.9684 10.1440 22.3081 38.4064 5.7895 0.1853 10.2716 19.1452 5.5575 1.8056 0.8130 1.3793 0.1862 7.7335 7.9559 26.8394 32.5491 0.4430 70.8219 3.2093 1.5293 4.6565 4.0478 16.2677 0.0120 22.1301 19.8579 2.8548 3.5818 2.2013 1.9502 556.9711 307.2115 647.4301 577.7733 127.4873 559.4242 209.4304 43.8079 138.8568 157.0529 20.3683 40.3242 97.8757 356.3882 274.9489 650.6120 24.4480 4.2535 6.6998 0.6844 223.8620 44.5227 1.5490 16.1509 28.2807 34.3661 171.9569 15.3440 11.7164 2.8110 6.0237 5.6736 32.3328 1523.4113 146.8347 1178.4438 52.3159 384.7055 5.2386 6.9981 3.3349 5.0271 46.4706 6.9660 7.2024 7.0691 6.8122 43.5115 28.5215 9.6271 11.3449 10.2538 13.1475 16.7893 2.1864 0.0541 7.5799 29.7638 42.6184 2.8134
temp: 298.150 k
press: 1.00000 atm
elementType: 45 6 6 8 6 1 1 1 8 6 6 1 1 8 6 8 45 8 6 8 8 6 8 8 6 8 6 1 1 1 6 1 1 1 6 1 1 1 6 1 1 1 6 6 6 6 1 6 1 6 1 1 1
symmnumber: 1
zpe: 1035821.6 jmol-1
zpe.correction: 0.394524 hartree
zpe.thermalcorrener: 0.429037 hartree
zpe.thermalcorrenthalpy: 0.429981 hartree
zpe.thermalcorrgfe: 0.323682 hartree
zpe.sumelectzpe: -1708.385698 hartree
zpe.sumelectthermal: -1708.351185 hartree
zpe.sumelectthermalent: -1708.350241 hartree
zpe.sumelectthermalfe: -1708.456540 hartree
dipole: 10.9720 1.8359 -1.9568
dipole: 11.2953
quadrupole: -148.0730 -190.6781 -198.6846
quadrupole: -21.2520 -1.1517 -9.1376
quadrupole: 31.0722 -11.5329 -19.5393 -21.2520 -1.1517 -9.1376
hfenergy: -1708.7802218 hartree
pointgroup: C01 [X(C19H22O10Rh2)]
dipole: -4.2855499 0.7164747 0.932264 debye
polarizability: 706.7094964|-2.3972781|444.4138218|-10.4907734|-2.6711524|288.682592 unknown
InChI: InChI=1S/C11H10O2.4C2H3O2.2Rh/c1-13-11(12)9-5-8-10-6-3-2-4-7-10;4*1-2(3)4;;/h2-8H,1H3;4*1H3;;/q;4*-2;2*+4
charge 0 multiplicity 1
53 atoms
Rh 0.49234029 0.25260579 -0.06700415
C  -0.86769601 1.76554128 -0.048518
C  -0.28852106 3.12435178 -0.13448538
O  0.06291638 3.61937541 1.05875862
C  0.74523879 4.89196157 1.03471231
H  0.11173256 5.65857688 0.5813701
H  1.67729548 4.80684262 0.47002638
H  0.94976849 5.13029797 2.07771282
O  -0.12766336 3.69243663 -1.20173371
C  -2.2645317 1.67537884 -0.04378652
C  -2.91646587 0.45279265 0.0170712
H  -2.29386637 -0.43292836 0.04113851
H  -2.85411087 2.59213042 -0.07286234
O  1.64386114 1.14478235 -1.53872054
C  2.70373437 0.56202668 -1.95220189
O  3.14597131 -0.56137252 -1.5644156
Rh 2.1121852 -1.6150727 -0.1032214
O  0.91869811 -2.49340349 -1.5681387
C  -0.14279576 -1.91074493 -1.93841981
O  -0.57713755 -0.78481065 -1.51173687
O  3.17609955 -0.59726548 1.36155325
C  2.75911316 0.53231314 1.7597486
O  1.70124651 1.13328409 1.36925319
O  0.9496747 -2.53295257 1.35967275
C  -0.09085019 -1.94862142 1.7826588
O  -0.51866369 -0.80045946 1.41200617
C  3.50036605 1.31450493 -2.99420555
H  2.83406962 1.66663825 -3.78660806
H  3.95480826 2.1952699 -2.52723088
H  4.28426999 0.68097914 -3.41199124
C  -0.9927077 -2.57913204 -2.99533762
H  -2.03677241 -2.60000319 -2.6692233
H  -0.94590921 -1.98928592 -3.91719691
H  -0.63837918 -3.59174407 -3.19337185
C  3.58709383 1.26964923 2.78869155
H  4.01592685 2.16496303 2.32544309
H  2.94633622 1.59771501 3.61216774
H  4.39052304 0.63499699 3.16552557
C  -0.92400134 -2.64548512 2.83446204
H  -0.87336601 -2.07581933 3.76854129
H  -1.97110634 -2.66644969 2.51708619
H  -0.56161558 -3.66010457 3.0054647
C  -4.33320006 0.22007622 0.06774168
C  -5.29932075 1.25574261 0.04509247
C  -4.7758245 -1.12283515 0.14417171
C  -6.65207043 0.95121759 0.09585571
H  -4.98612237 2.29262774 -0.01186136
C  -6.13193118 -1.42228104 0.19546997
H  -4.03851232 -1.92116276 0.16348566
C  -7.07096618 -0.38535854 0.17131981
H  -7.38763404 1.7493199 0.07798627
H  -6.46032685 -2.45516299 0.25439577
H  -8.13160997 -0.61561465 0.21171876
