program: Gaussian 16
title: wamser cis sm 631g
version: ES64L-G16RevA.03
frameworkgroup: C1[X(C15H18O10Rh2)]
method: RB3LYP
basis: GenECP
operation: Freq
keyword: #NGeom=AllCheck
keyword: Guess=TCheck
keyword: SCRF=Check
keyword: GenChk
keyword: RB3LYP/GenECP
keyword: Freq
converged: YES YES YES YES
title: Mulliken charges:
elementType: Rh C C O C H H H O C C H H H O C O Rh O C O H O C O H O C O H H C C C C C C H H H H H H H H
charge: 0.401624 -0.234330 0.643691 -0.446477 -0.211872 0.169371 0.173145 0.160883 -0.440340 -0.054533 -0.325280 0.156736 0.208636 0.213537 -0.446458 0.444591 -0.457774 0.556133 -0.451728 0.444143 -0.460198 0.156338 -0.458646 0.448359 -0.454117 0.157452 -0.456178 0.445881 -0.451856 0.155430 0.155793 -0.350534 -0.102959 -0.101295 -0.168637 -0.099480 -0.107253 0.125510 0.117728 0.146991 0.209861 0.142349 0.123272 0.168853 0.153642
chargesum: -0.00000
title: Mulliken charges with hydrogens summed into heavy atoms:
elementType: Rh C C O C O C C O C O Rh O C O O C O O C O C C C C C C
charge: 0.401624 -0.024469 0.643691 -0.446477 0.291526 -0.440340 0.159004 0.040091 -0.446458 0.600384 -0.457774 0.556133 -0.451728 0.600481 -0.460198 -0.458646 0.605811 -0.454117 -0.456178 0.601311 -0.451856 -0.028039 0.020313 0.041054 -0.021647 0.018248 0.018257
chargesum: 0.00000
1716.lowfreq: -5.0261 -0.0006 0.0004 0.0004 4.2410 6.1863 22.4306 38.9061 48.8906
frequency: 22.3409 38.8797 48.8887 55.6064 70.0875 71.3669 75.7869 84.7408 88.3214 109.0299 127.1784 132.3401 136.9836 147.9192 149.3624 158.0613 160.9086 174.4676 178.5679 185.8405 207.2533 240.2077 248.6221 260.0264 263.0256 272.7034 276.5416 310.2186 314.4920 326.4467 333.0826 371.1242 373.8738 378.8568 379.4736 393.9914 413.2679 416.2718 433.7933 439.2270 444.7323 445.4518 455.9446 471.6495 489.7274 526.3680 582.9485 611.7432 699.2327 703.4708 742.5797 754.2732 788.7222 792.2193 816.9432 828.0540 839.5454 872.3376 887.3692 896.7797 918.0333 938.5030 982.2883 990.1898 999.3380 1007.8526 1019.1188 1037.3364 1039.7155 1040.4518 1040.7778 1044.4498 1085.3651 1098.7022 1110.5199 1183.9326 1208.0404 1222.7172 1229.4997 1244.4804 1262.3595 1264.9509 1310.3003 1337.3070 1363.8959 1373.6277 1375.4236 1375.8537 1378.0848 1383.5049 1399.7809 1401.0821 1401.8837 1403.4361 1404.8276 1412.1493 1417.6416 1456.4847 1488.8515 1490.4178 1497.2999 1511.6365 1522.5985 1586.6500 1593.7957 1627.0645 1655.0931 1693.0846 1721.5691 1767.7233 1813.0037 2954.6372 2987.5111 3000.5236 3020.2368 3070.1010 3078.9827 3079.8513 3080.7884 3081.7795 3083.9115 3145.6060 3147.5753 3171.4105 3176.0740 3176.2957 3186.7825 3208.5747 3271.0079
redmass: 6.6623 5.4532 4.0204 5.8701 4.2848 4.7295 9.3689 7.4907 6.1284 5.4150 5.2752 3.7264 1.8337 4.9599 4.8754 2.4641 12.0764 4.3363 7.7711 8.7177 14.7270 4.1049 11.9263 13.5396 16.6023 3.1371 3.2412 2.5083 41.2543 2.8069 2.3323 4.8517 4.4579 9.2824 2.9394 10.5345 9.0347 9.8655 2.6997 3.2743 6.5017 6.6515 9.1313 9.7129 6.4138 5.1253 6.5699 1.6434 2.5141 2.8901 1.2627 4.6703 12.0299 11.8263 12.0481 12.2203 2.2324 4.1199 3.3240 3.3515 2.2363 2.6862 3.2379 1.5317 1.6869 1.3457 1.4231 1.6299 1.6255 1.6198 1.6229 1.1599 6.6827 1.7955 2.1442 1.2757 1.0304 1.4623 1.0963 1.1085 1.0846 1.5205 3.7942 1.3035 1.3252 8.8906 4.5137 1.5948 8.4489 8.4581 1.7109 1.1382 1.1371 1.1459 1.1703 1.5056 2.0784 1.4416 1.1146 1.2181 1.0880 1.0487 1.0466 9.4076 9.2262 8.9162 4.7130 9.1505 6.6725 6.4979 10.6705 1.0812 1.0636 1.0959 1.0716 1.0293 1.0871 1.0875 1.0874 1.0883 1.0876 1.1073 1.0850 1.0870 1.0957 1.1073 1.0887 1.0933 1.0890
irintensity: 0.1204 0.1341 0.5318 0.4733 0.5144 0.4826 0.4505 0.8595 0.6416 0.3893 0.3503 0.1691 2.2927 2.7383 3.7996 1.4097 0.0048 0.2515 1.5023 0.5833 0.0915 0.1024 0.0345 0.0359 0.0688 2.6103 0.6294 0.0104 7.4053 9.4932 4.2561 3.5976 2.8108 0.1278 0.1110 0.8192 0.3981 0.1506 1.4920 4.5050 86.1199 101.8021 0.2494 25.8929 4.7512 2.4946 0.0460 43.8651 22.8775 8.8292 2.6607 6.1715 51.5928 51.3872 0.0793 0.9661 6.9115 11.2383 2.0245 31.6906 13.7105 5.6458 1.9398 18.4872 5.8308 5.4888 0.1164 0.0045 0.0456 0.0135 0.0250 25.7271 81.7031 9.3093 2.7025 0.4012 0.4656 8.2723 0.1082 7.5866 4.8813 44.6700 304.7713 3.7274 7.2395 225.2783 11.0476 3.6682 209.9459 30.2475 1.5641 5.5918 33.0871 18.0321 37.8730 11.2294 1.2966 1.6030 31.4626 12.1644 5.1440 4.0303 4.4514 3.2453 4.1543 0.4486 36.2350 801.3733 0.4344 1.5530 183.1335 35.5924 33.8516 34.2191 27.4442 35.2242 43.4071 86.7774 50.9485 3.5875 49.3678 21.2681 11.7877 18.2789 36.4330 16.2860 0.8732 13.3230 1.3723
temp: 298.150 k
press: 1.00000 atm
elementType: 45 6 6 8 6 1 1 1 8 6 6 1 1 1 8 6 8 45 8 6 8 1 8 6 8 1 8 6 8 1 1 6 6 6 6 6 6 1 1 1 1 1 1 1 1
symmnumber: 1
zpe: 870723.6 jmol-1
zpe.correction: 0.331641 hartree
zpe.thermalcorrener: 0.360146 hartree
zpe.thermalcorrenthalpy: 0.361090 hartree
zpe.thermalcorrgfe: 0.272305 hartree
zpe.sumelectzpe: -1553.551514 hartree
zpe.sumelectthermal: -1553.523009 hartree
zpe.sumelectthermalent: -1553.522065 hartree
zpe.sumelectthermalfe: -1553.610850 hartree
dipole: -1.6985 0.1589 2.2966
dipole: 2.8609
quadrupole: -187.3246 -169.5644 -172.9583
quadrupole: 8.4404 -1.7517 3.9079
quadrupole: -10.7088 7.0513 3.6575 8.4404 -1.7517 3.9079
hfenergy: -1553.8831552 hartree
pointgroup: C01 [X(C15H18O10Rh2)]
dipole: -0.7152671 -0.2178683 0.8413025 debye
polarizability: 270.4579777|-7.4492589|225.8703188|6.8016023|-1.9594329|234.4950492 unknown
InChI: InChI=1S/C11H14O2.4CHO2.2Rh/c1-13-11(12)9-5-8-10-6-3-2-4-7-10;4*2-1-3;;/h3-7,9-10H,2,8H2,1H3;4*1H;;/q;4*-2;2*+4
charge 0 multiplicity 1
45 atoms
Rh 0.09869974 0.07999216 0.24090454
C  -2.3703817 0.89605986 0.2587547
C  -2.16932475 2.36850645 0.17713994
O  -1.72398819 2.90740608 1.33235545
C  -1.40985248 4.30393991 1.26631458
H  -2.29075611 4.88790161 0.98465878
H  -0.61811522 4.47153651 0.53088103
H  -1.07009353 4.57631004 2.26621763
O  -2.41502865 3.0125701 -0.82159588
C  -2.33383452 0.1888016 1.41979256
C  -2.85984838 -1.1980097 1.66588568
H  -3.46649501 -1.13192747 2.58223058
H  -2.01410681 -1.84757502 1.92175117
H  -1.9755504 0.70818308 2.30677205
O  -0.29752776 -0.41382724 -1.73101865
C  0.67109814 -0.76853533 -2.46698578
O  1.89466327 -0.87038711 -2.16117885
Rh 2.44741647 -0.37667174 -0.23124354
O  2.14648017 -2.33390629 0.35700013
C  0.98457958 -2.65925757 0.72459757
O  -0.0513357 -1.92785602 0.7865472
H  0.84588035 -3.70628707 1.02982967
O  2.67175219 1.58966777 -0.807724
C  1.65585583 2.33732933 -0.7306679
O  0.49050561 2.03574664 -0.33637283
H  1.79632934 3.38203454 -1.0418343
O  2.8652598 0.14639499 1.72819234
C  1.89957136 0.48040412 2.47281631
O  0.66691366 0.54818944 2.18165636
H  2.15807763 0.74699138 3.50767688
H  0.41042937 -1.02217855 -3.50441564
C  -4.60840231 -1.086771 -2.19914514
C  -3.33628875 -1.84153839 -1.91822359
C  -2.93314429 -2.18396715 -0.6929588
C  -3.71462798 -1.88111553 0.56389852
C  -4.98506663 -1.11587171 0.27518178
C  -5.38584344 -0.76787945 -0.94946599
H  -6.31670438 -0.21791932 -1.07773171
H  -5.59151646 -0.84846627 1.14041804
H  -4.00290214 -2.84670133 1.01690109
H  -2.74285163 0.46053539 -0.65875748
H  -1.98239548 -2.6905196 -0.55431092
H  -2.71048824 -2.08257375 -2.77513327
H  -4.37160328 -0.15215081 -2.7358275
H  -5.24140832 -1.65518756 -2.9005298
