program: Gaussian 16
title: wamser cis sm 631g
version: ES64L-G16RevA.03
frameworkgroup: C1[X(C15H18O10Rh2)]
method: RB3LYP
basis: GenECP
operation: Freq
keyword: #NGeom=AllCheck
keyword: Guess=TCheck
keyword: SCRF=Check
keyword: GenChk
keyword: RB3LYP/GenECP
keyword: Freq
converged: YES YES YES YES
title: Mulliken charges:
elementType: Rh C C O C H H H O C C H H H O C O Rh O C O H O C O H O C O H H C C C C C C H H H H H H H H
charge: 0.373751 -0.375116 0.669531 -0.437857 -0.205302 0.154377 0.176999 0.155662 -0.524115 0.027470 -0.349664 0.134901 0.121878 0.165081 -0.455071 0.437382 -0.456970 0.482845 -0.443782 0.431977 -0.478646 0.127626 -0.461561 0.438413 -0.443199 0.140381 -0.450476 0.429887 -0.470761 0.128136 0.137540 -0.449199 -0.035688 -0.095834 -0.112199 -0.088825 -0.023376 0.187998 0.167743 0.182548 0.150535 0.180315 0.191159 0.362548 0.200958
chargesum: 0.00000
title: Mulliken charges with hydrogens summed into heavy atoms:
elementType: Rh C C O C O C C O C O Rh O C O O C O O C O C C C C C C
charge: 0.373751 -0.224581 0.669531 -0.437857 0.281736 -0.524115 0.192551 -0.092884 -0.455071 0.574922 -0.456970 0.482845 -0.443782 0.559603 -0.478646 -0.461561 0.578793 -0.443199 -0.450476 0.558023 -0.470761 0.114307 0.155470 0.084481 0.070349 0.078919 0.164622
chargesum: -0.00000
1716.lowfreq: -168.7552 -5.3541 -4.7122 0.0007 0.0007 0.0008 1.8505 29.4081 38.1937
frequency: -168.7547 29.3730 38.1754 50.1557 59.0140 63.8104 68.8754 81.4168 83.1887 90.0667 99.3564 107.4336 124.8457 135.8170 142.5926 145.8712 147.8901 156.8774 165.9256 174.3017 179.7852 190.5082 204.5830 211.3889 229.0894 242.6499 255.1005 258.7108 290.0641 302.3358 309.0944 344.8702 354.0206 356.9839 359.1731 367.0156 371.9595 377.9398 399.3230 401.9839 412.2447 428.8282 431.4710 440.3378 456.0716 463.2099 508.8401 589.5916 596.7361 646.0826 663.7755 723.6255 758.2971 771.4010 785.1945 788.0986 809.8734 817.6003 823.0403 870.3821 877.0997 906.8459 926.0310 956.5319 987.7115 995.4722 1001.7666 1012.1857 1020.8604 1029.4472 1034.5429 1035.4204 1036.7398 1037.6358 1037.9102 1093.4792 1102.5878 1178.5195 1183.9874 1210.7799 1215.6071 1221.2096 1230.9928 1308.9835 1328.6218 1345.2030 1349.1233 1365.3718 1367.1284 1370.7130 1375.4322 1379.7407 1407.6589 1410.4944 1415.5369 1415.8248 1421.1109 1483.3470 1487.4528 1490.0911 1494.3605 1514.0256 1522.5999 1584.9171 1601.9295 1604.1967 1633.4960 1633.8403 1675.2347 1680.7069 1698.7216 2495.7732 3034.3514 3035.7894 3055.6564 3060.6726 3064.9440 3078.2620 3139.7558 3151.1049 3168.9317 3196.6007 3203.8142 3219.7443 3220.6444 3237.9846 3239.3971 3240.5003 3256.3055
redmass: 2.0011 5.7519 4.5584 6.9178 4.9730 5.9677 4.6832 6.2272 5.8512 4.8487 4.7804 4.6110 5.0550 2.5060 3.8837 3.0086 5.8374 5.9052 3.8811 4.7896 3.6815 4.6364 4.8831 5.0875 2.9301 5.7975 17.3583 18.0101 15.5106 2.4805 4.2291 3.8346 6.8741 4.6650 2.8343 6.1920 3.1323 6.6971 10.0313 7.9422 3.4930 5.7154 5.8793 9.2142 7.6447 2.6371 6.3376 4.4873 6.2185 1.4520 1.7543 3.9994 2.4705 1.7286 11.8901 7.5736 10.2466 3.1647 3.3979 3.8132 1.3362 1.4324 2.8089 1.2582 1.4866 1.5302 1.6130 4.1663 1.4753 2.3075 1.6471 1.1315 1.6347 1.6332 1.6310 1.6962 3.2333 1.1927 1.2754 1.0977 1.8548 1.1423 1.7773 2.2033 1.7019 1.1266 1.6400 6.8994 7.2211 8.7635 7.6106 1.3199 1.1324 1.1414 1.1644 1.1892 3.6095 1.3961 2.0919 1.8708 1.3021 1.0497 1.0487 3.1896 9.6405 9.4345 5.0294 8.9733 4.9969 5.0053 9.0716 1.0745 1.0849 1.0852 1.0858 1.0860 1.0299 1.0830 1.1068 1.0593 1.1068 1.0902 1.0883 1.0872 1.0879 1.0928 1.0940 1.1125 1.0953
irintensity: 26.4151 0.2905 0.3530 1.0768 2.6997 1.2583 0.4131 1.9681 7.4176 0.2490 0.3404 0.0397 0.1006 3.1661 2.9063 1.9326 3.2042 2.3075 0.9366 0.5537 4.2798 0.4271 2.7693 0.4963 7.9829 1.3277 0.0429 0.1905 13.3857 0.1318 46.0567 26.8366 2.5500 3.8375 3.7394 0.9333 0.6343 9.1709 1.3844 9.6244 11.6857 57.6265 73.0604 1.8874 14.8833 59.0824 20.9591 11.1732 2.3157 13.2243 9.6207 1.7467 8.8382 28.1445 41.2285 28.4857 2.8787 80.3832 38.6884 10.3742 24.7619 127.8958 13.5669 18.4592 14.5995 2.3979 22.6101 7.3100 8.3700 0.5864 0.0209 16.6010 0.2419 0.0218 0.0194 47.3201 58.1126 3.1805 1.1751 4.5217 18.7334 9.4728 6.9063 426.5430 193.8968 37.6261 55.1549 114.4304 154.4340 107.6530 108.5168 13.7527 12.6938 24.2729 5.3040 22.5048 4.8010 8.1428 58.4092 28.4453 25.3540 4.2675 2.8345 1.9296 3.5881 15.7172 63.2659 3.8415 46.1965 125.3732 589.8071 148.2080 93.0796 64.5208 93.0001 102.4582 51.2355 1.7689 19.4048 11.2635 23.2090 2.5352 12.0969 6.1594 11.9779 1.0603 3.2407 23.8442 1.3797
temp: 298.150 k
press: 1.00000 atm
elementType: 45 6 6 8 6 1 1 1 8 6 6 1 1 1 8 6 8 45 8 6 8 1 8 6 8 1 8 6 8 1 1 6 6 6 6 6 6 1 1 1 1 1 1 1 1
symmnumber: 1
zpe: 852672.6 jmol-1
zpe.correction: 0.324766 hartree
zpe.thermalcorrener: 0.354124 hartree
zpe.thermalcorrenthalpy: 0.355068 hartree
zpe.thermalcorrgfe: 0.264636 hartree
zpe.sumelectzpe: -1553.497725 hartree
zpe.sumelectthermal: -1553.468366 hartree
zpe.sumelectthermalent: -1553.467422 hartree
zpe.sumelectthermalfe: -1553.557854 hartree
dipole: -9.6682 -3.0474 -1.1152
dipole: 10.1983
quadrupole: -167.2845 -167.5498 -171.6135
quadrupole: 18.5912 6.0584 -4.0103
quadrupole: 1.5315 1.2661 -2.7976 18.5912 6.0584 -4.0103
hfenergy: -1553.8224905 hartree
pointgroup: C01 [X(C15H18O10Rh2)]
dipole: -3.8029714 -1.2012319 -0.4394638 debye
polarizability: 418.7833763|43.3871566|277.9630826|10.8063859|23.2994886|270.1494838 unknown
InChI: InChI=1S/C6H7.C5H7O2.4CHO2.2Rh/c1-2-4-6-5-3-1;1-3-4-5(6)7-2;4*2-1-3;;/h1-5H,6H2;3-4H,1H2,2H3;4*1H;;/q;;4*-2;2*+4
charge 0 multiplicity 1
45 atoms
Rh 0.30843355 0.24704275 0.24796094
C  -1.74205312 0.97130675 0.942397
C  -2.15405041 1.69138923 -0.25589088
O  -1.86739859 3.01262073 -0.22659256
C  -1.98841783 3.70113148 -1.47447219
H  -3.01205408 3.64748458 -1.85756787
H  -1.30279506 3.26749055 -2.20784966
H  -1.71356854 4.73606794 -1.2650849
O  -2.69037003 1.16998335 -1.24357082
C  -1.56312383 1.67610676 2.20588828
C  -1.7773041 1.12462049 3.41314033
H  -1.59578907 1.6746874 4.33146926
H  -2.11340005 0.09430897 3.51525017
H  -1.20751863 2.70089393 2.14050606
O  0.78265695 1.96707684 -0.81551417
C  1.92921753 2.04426441 -1.35510376
O  2.8672903 1.20021207 -1.3560865
Rh 2.57271797 -0.60119024 -0.36242654
O  1.71708378 -1.39006156 -2.09977624
C  0.48793145 -1.21569651 -2.28822512
O  -0.35954955 -0.63671082 -1.53372746
H  0.07644276 -1.6211226 -3.22727571
O  3.27819914 0.2507276 1.38427321
C  2.4552847 0.87857144 2.10902583
O  1.21346207 1.06040159 1.93359101
H  2.8691444 1.33144939 3.0229385
O  2.08713628 -2.33424152 0.69863262
C  0.96190283 -2.40702478 1.25944795
O  0.00766002 -1.56657338 1.25907184
H  0.7685426 -3.33266966 1.82657117
H  2.12572335 2.98198051 -1.8977201
C  -3.12352004 -1.66407124 -1.55134562
C  -2.50197741 -2.42480272 -0.46618518
C  -3.02356822 -2.3951773 0.80236795
C  -4.21152662 -1.67416444 1.04634204
C  -4.91216431 -1.0128743 0.01966213
C  -4.40682387 -1.02432427 -1.25839685
H  -4.90738473 -0.49005164 -2.05876399
H  -5.8283176 -0.47906105 0.25008882
H  -4.59737024 -1.6269527 2.06127667
H  -2.21700073 -0.00084762 1.02120891
H  -2.50016992 -2.87115048 1.62316467
H  -1.55793637 -2.91892736 -0.66088944
H  -2.42758688 -0.76182841 -1.65831247
H  -3.05448886 -2.13334113 -2.54070132
