program: Gaussian 16
title: wamser cis sm 631g
version: ES64L-G16RevA.03
frameworkgroup: C1[X(C15H18O10Rh2)]
method: RB3LYP
basis: GenECP
operation: Freq
keyword: #NGeom=AllCheck
keyword: Guess=TCheck
keyword: SCRF=Check
keyword: GenChk
keyword: RB3LYP/GenECP
keyword: Freq
converged: YES YES YES YES
title: Mulliken charges:
elementType: Rh C C O C H H H O C C H H H O C O Rh O C O H O C O H O C O H H C C C C C C H H H H H H H H
charge: 0.441384 -0.208889 0.633310 -0.448852 -0.214604 0.186358 0.164466 0.160022 -0.429931 -0.053202 -0.322383 0.148807 0.206091 0.159195 -0.470399 0.433827 -0.448901 0.487453 -0.443368 0.433759 -0.480247 0.135067 -0.454903 0.441605 -0.459736 0.139931 -0.455932 0.438245 -0.447423 0.142308 0.137197 -0.302231 -0.187507 -0.027752 -0.109762 -0.068941 -0.313788 0.168469 0.163157 0.157807 0.209870 0.242003 0.173304 0.165136 0.179979
chargesum: 0.00000
title: Mulliken charges with hydrogens summed into heavy atoms:
elementType: Rh C C O C O C C O C O Rh O C O O C O O C O C C C C C C
charge: 0.441384 -0.208889 0.633310 -0.448852 0.296242 -0.429931 0.105993 0.032514 -0.470399 0.571024 -0.448901 0.487453 -0.443368 0.568826 -0.480247 -0.454903 0.581536 -0.459736 -0.455932 0.580553 -0.447423 0.036209 0.054496 0.182118 0.048045 0.094216 0.034660
1716.lowfreq: -182.3169 -8.0162 -4.8256 -0.0009 -0.0009 -0.0006 3.6067 29.5996 42.2273
frequency: -182.3168 29.5760 42.2231 63.2243 74.4100 76.4964 87.3383 99.1720 109.0234 121.3190 126.1404 140.7289 143.9692 145.2102 150.0796 155.8245 161.9208 176.5541 177.3292 185.7461 196.9309 210.2071 226.2220 230.8279 246.9536 259.8607 260.5766 269.9810 300.1841 300.7976 312.0925 354.0962 356.8595 361.5185 367.2172 372.0714 379.6204 402.7271 407.2175 407.9583 416.5356 431.1429 432.7443 441.4317 455.6991 473.6334 502.8052 541.4634 587.1238 680.4183 714.4933 726.6246 786.4314 787.0748 791.1456 805.4045 809.8776 820.2290 844.8395 905.5742 911.2181 926.9746 978.6908 992.0474 1001.5982 1006.2830 1015.7350 1025.5962 1034.5676 1036.9115 1037.4844 1038.4410 1043.6977 1074.9534 1101.4570 1113.7793 1182.3763 1203.5915 1205.3601 1214.2457 1225.4349 1229.6119 1285.4766 1286.1052 1359.1891 1363.2022 1366.7344 1369.4650 1374.7603 1376.0982 1381.1880 1408.6717 1410.6242 1413.0273 1415.6905 1422.4666 1465.2331 1479.8321 1487.3175 1493.2827 1511.0250 1521.5920 1523.4656 1556.8336 1600.2200 1607.6029 1631.4981 1637.9124 1649.7087 1700.5047 1763.0689 3026.6321 3042.5084 3046.9302 3050.3392 3058.0115 3060.7715 3072.5123 3072.7463 3111.0465 3133.8296 3152.6106 3177.5510 3179.1617 3183.0652 3210.5566 3232.8610 3264.7715 3286.5923
redmass: 7.1883 5.6457 4.7528 5.9192 7.2569 5.2359 8.3144 4.9301 5.0385 4.5697 5.1585 4.6128 5.0653 3.9411 2.0138 2.7283 7.7820 4.8561 6.9903 5.5384 4.3625 10.5361 2.3655 3.9681 11.1399 15.7047 15.1254 3.6889 8.0379 2.5258 2.6840 3.8147 6.1796 4.8478 6.3813 3.0136 9.0945 10.0689 8.1214 4.6626 3.2308 5.9505 6.6097 9.1011 9.4005 4.2069 2.9452 3.3764 5.6727 2.2287 1.2478 2.8850 6.9117 11.6541 4.7347 1.7294 11.0859 11.9936 3.9945 3.2072 2.1530 1.7678 1.3825 2.5401 2.1808 1.7736 2.1242 1.1809 1.6403 1.6280 1.6414 1.6295 1.7740 1.9316 1.9186 1.5701 1.2942 2.2683 1.0748 1.2577 1.4781 1.1659 4.1126 1.2524 1.4057 6.0735 7.6331 8.1731 6.2449 1.4123 1.5368 1.1471 1.1568 1.1717 1.1844 1.5864 1.3516 1.6706 1.2140 1.1124 1.0489 1.1660 1.0473 3.6424 9.6557 9.7142 4.9433 5.0425 3.7276 9.4582 11.2629 1.0742 1.0665 1.0856 1.0858 1.0860 1.0862 1.0924 1.0298 1.0920 1.0855 1.1064 1.0645 1.1082 1.0872 1.0945 1.0880 1.0919 1.1135
irintensity: 140.2678 0.6058 0.1766 0.6161 1.5483 0.0803 0.5653 1.5666 4.6401 1.4772 1.1174 3.3303 2.4766 2.2577 1.2593 1.2701 0.2969 1.6410 5.1601 0.4675 4.8357 0.4283 4.7423 6.3800 0.8488 0.2392 1.7167 17.3808 5.6352 0.1966 4.9396 17.6122 8.1603 5.9304 1.0775 0.2197 5.2783 1.4152 5.2629 2.3508 7.3152 79.6984 70.8523 5.2905 16.6943 30.5477 0.4945 6.4331 3.7466 31.9157 13.8341 108.3467 14.3059 35.5385 47.1134 2.4393 0.4647 5.3280 4.1341 12.5594 42.8986 6.9440 3.0959 2.8916 3.2194 1.8669 1.2165 21.4559 0.0134 0.0079 0.0351 0.0101 0.2802 11.0694 67.3037 11.5058 4.9628 122.1964 14.2520 7.6796 12.3098 35.7558 299.8810 47.7518 5.9381 122.8211 208.5465 75.5628 106.1809 1.2842 4.4396 11.3257 18.0370 16.6777 17.7568 8.2964 19.8346 10.5781 16.1732 35.8655 2.8278 34.1544 4.4486 132.7347 6.3568 1.2289 21.8741 12.6679 41.6442 731.0879 191.6394 16.3195 25.6847 81.4572 88.5322 81.7691 82.9287 18.6940 40.0766 8.8270 10.3374 15.9094 15.2125 14.4699 5.0047 15.0561 9.8565 0.5501 1.6580
temp: 298.150 k
press: 1.00000 atm
elementType: 45 6 6 8 6 1 1 1 8 6 6 1 1 1 8 6 8 45 8 6 8 1 8 6 8 1 8 6 8 1 1 6 6 6 6 6 6 1 1 1 1 1 1 1 1
symmnumber: 1
zpe: 862921.7 jmol-1
zpe.correction: 0.328670 hartree
zpe.thermalcorrener: 0.357063 hartree
zpe.thermalcorrenthalpy: 0.358007 hartree
zpe.thermalcorrgfe: 0.271149 hartree
zpe.sumelectzpe: -1553.481542 hartree
zpe.sumelectthermal: -1553.453149 hartree
zpe.sumelectthermalent: -1553.452205 hartree
zpe.sumelectthermalfe: -1553.539062 hartree
dipole: -9.3693 -2.3199 -1.9550
dipole: 9.8482
quadrupole: -170.8758 -163.5208 -178.3335
quadrupole: 13.4803 6.1473 -7.5234
quadrupole: 0.0342 7.3892 -7.4235 13.4803 6.1473 -7.5234
hfenergy: -1553.8102115 hartree
pointgroup: C01 [X(C15H18O10Rh2)]
dipole: -3.6223153 -1.2904963 -0.4753082 debye
polarizability: 346.1497179|20.9828121|253.7483393|-8.2875889|-11.4994276|226.4128381 unknown
InChI: InChI=1S/C6H8.C5H6O2.4CHO2.2Rh/c1-2-4-6-5-3-1;1-3-4-5(6)7-2;4*2-1-3;;/h1-4H,5-6H2;3H,1H2,2H3;4*1H;;/q;;4*-2;2*+4
charge 0 multiplicity 1
45 atoms
Rh 0.17045001 0.0833828 0.00229616
C  -1.90893146 0.4450315 0.22305305
C  -2.21829831 1.83696197 -0.25703424
O  -2.13294117 2.01747387 -1.58964514
C  -2.11724748 3.38822055 -2.01548854
H  -1.2523662 3.89485522 -1.5808903
H  -3.03245582 3.90294421 -1.70911293
H  -2.03919583 3.35359572 -3.10271996
O  -2.43946514 2.74673628 0.52194597
C  -2.57688104 0.13701072 1.47677372
C  -2.36600539 -0.96405377 2.23196492
H  -2.89611868 -1.09861667 3.17117848
H  -1.62830642 -1.7076534 1.95798296
H  -3.30543503 0.87194049 1.8223807
O  0.02422532 -0.40556148 -2.02375181
C  1.09860021 -0.66499071 -2.65676271
O  2.28098931 -0.69098872 -2.22923686
Rh 2.62981669 -0.26323878 -0.21391843
O  2.2970509 -2.26506293 0.27181238
C  1.12147282 -2.6399931 0.50162086
O  0.04408323 -1.9582424 0.47057388
H  0.99018775 -3.70188142 0.76415036
O  2.7814145 1.75523513 -0.6746914
C  1.72626636 2.44161909 -0.69861676
O  0.52873649 2.074048 -0.48361579
H  1.845746 3.50902802 -0.94009971
O  2.76356267 0.19793409 1.80896953
C  1.7025987 0.47478817 2.43160125
O  0.507342 0.51110439 2.00117836
H  1.81634216 0.71794699 3.49914955
H  0.9617087 -0.90034057 -3.72412868
C  -4.40304906 -0.33182308 -1.09975213
C  -2.92132308 -0.63958653 -1.24186347
C  -2.49726705 -1.9322588 -0.9542212
C  -3.24172119 -2.7820331 -0.0904874
C  -4.39924881 -2.33836776 0.47677508
C  -5.08368825 -1.06169763 0.08138303
H  -6.12861983 -1.29161985 -0.1687483
H  -4.89129119 -2.94613568 1.2337732
H  -2.81943826 -3.73851677 0.20275836
H  -1.51815766 -2.24523902 -1.29319901
H  -2.38649434 -0.12324277 -2.03011195
H  -4.57124994 0.74666301 -1.03280586
H  -4.87219839 -0.65336385 -2.04062032
H  -5.13799671 -0.41850449 0.96816814
