program: Gaussian 16
title: wamser cis sm 631g
version: ES64L-G16RevA.03
frameworkgroup: C1[X(C15H18O10Rh2)]
method: RB3LYP
basis: GenECP
operation: Freq
keyword: #NGeom=AllCheck
keyword: Guess=TCheck
keyword: SCRF=Check
keyword: GenChk
keyword: RB3LYP/GenECP
keyword: Freq
converged: YES YES YES YES
title: Mulliken charges:
elementType: Rh C C O C H H H O C C H H H O C O Rh O C O H O C O H O C O H H C C C C C C H H H H H H H H
charge: 0.460041 -0.317388 0.628115 -0.422002 -0.215981 0.186519 0.166233 0.165587 -0.453105 -0.007368 -0.305142 0.163238 0.170282 0.190958 -0.468184 0.438013 -0.448311 0.490313 -0.444896 0.435024 -0.473381 0.138571 -0.453723 0.441995 -0.458242 0.141487 -0.453955 0.440563 -0.449318 0.144124 0.141844 -0.265686 -0.334630 -0.090632 -0.110166 -0.107007 -0.087753 0.167376 0.148310 0.139299 0.220836 0.149495 0.179444 0.190388 0.228816
chargesum: -0.00000
title: Mulliken charges with hydrogens summed into heavy atoms:
elementType: Rh C C O C O C C O C O Rh O C O O C O O C O C C C C C C
charge: 0.460041 -0.317388 0.628115 -0.422002 0.302358 -0.453105 0.183589 0.028378 -0.468184 0.579856 -0.448311 0.490313 -0.444896 0.573595 -0.473381 -0.453723 0.583481 -0.458242 -0.453955 0.584687 -0.449318 0.153518 0.065650 0.058864 0.029134 0.041303 0.079623
1716.lowfreq: -408.3344 -7.6755 -2.6461 -0.0007 -0.0006 -0.0003 5.4371 27.1681 44.3809
frequency: -408.3343 27.1613 44.3660 55.4020 60.4331 71.3005 76.4287 85.9074 99.0215 101.3729 112.2555 125.4814 137.0862 139.2305 144.9685 149.9666 154.4895 160.4906 166.9589 172.6858 184.9591 193.2095 208.5321 218.3610 245.1717 256.1873 262.2381 266.0164 295.8182 302.1748 304.8775 328.9211 361.4371 362.9649 368.9363 372.9493 382.2527 403.9413 406.7718 409.7296 423.7385 434.8857 437.0574 443.3511 457.7386 520.0009 530.5349 570.7143 586.3712 612.2417 672.2318 702.6145 786.1496 787.2730 803.9786 808.6769 810.4287 819.7852 830.7062 873.6742 885.4235 952.8361 964.9894 979.2711 987.3476 992.5941 1005.9846 1008.6006 1020.3416 1025.6645 1035.1432 1037.4623 1038.2232 1038.3293 1053.1666 1120.3975 1151.5792 1177.2831 1182.0771 1202.8581 1206.8610 1222.6869 1233.1358 1284.5767 1312.5858 1350.6429 1362.2097 1362.9426 1365.3079 1368.0769 1370.4627 1373.0272 1408.4559 1410.0663 1411.1888 1412.5609 1424.5472 1451.4018 1466.5433 1472.2052 1486.5229 1509.2904 1512.0787 1521.3331 1599.4701 1602.5067 1609.8506 1632.7230 1656.9425 1697.3544 1698.6993 1778.6856 2968.2484 3051.9892 3057.1709 3060.3186 3062.5485 3072.9049 3139.6797 3151.4408 3168.4518 3182.8456 3183.8694 3191.4698 3194.6705 3194.8826 3209.4644 3224.7115 3256.7395
redmass: 2.6392 6.0109 5.5656 4.6365 5.7980 6.2958 4.6188 8.5351 5.0948 4.0712 4.5124 5.1548 1.8781 2.5596 4.0495 5.3735 6.8615 5.2802 6.2995 7.6014 4.6808 5.2490 13.9191 3.1026 7.4488 13.6786 8.8076 7.0921 2.1291 2.4855 6.4962 5.6306 5.5607 5.2189 7.0315 2.9387 10.1592 3.1679 9.0647 8.3862 3.2713 6.3928 6.8608 9.2565 9.4936 2.6598 3.1933 2.0079 5.4479 1.9639 7.1895 1.3054 10.9296 11.9192 1.4619 6.0614 5.0574 11.9514 1.6218 3.4671 4.7603 1.7782 1.5317 1.6229 1.8919 1.6984 1.7943 3.2265 1.6317 1.9798 1.6412 1.6355 1.6370 1.6270 1.9164 1.4214 1.5818 1.3500 1.3283 1.2048 1.1780 1.3750 1.3833 1.3125 4.3491 1.3991 6.1660 1.7306 6.0327 7.9076 1.3999 7.1028 1.1535 1.1595 1.1754 1.1872 1.3906 1.4518 1.5187 1.1689 1.2080 1.5230 1.0483 1.0474 9.7655 9.6091 3.5427 9.2254 3.0966 4.8137 9.0884 10.7603 1.0743 1.0858 1.0861 1.0861 1.0863 1.0294 1.0842 1.1075 1.0576 1.1075 1.0858 1.0865 1.0914 1.0890 1.0970 1.0950 1.1165
irintensity: 1014.6880 0.0396 0.2489 1.0179 1.2483 0.7134 0.1988 0.3830 3.6384 18.1945 1.9584 0.0122 0.4888 0.2586 2.5570 4.8018 2.5767 1.1820 0.5100 1.2299 3.6183 6.2832 0.4367 1.4108 0.9635 4.9886 4.7290 20.2725 0.3290 0.1516 67.1372 21.4096 4.2884 4.1538 0.8557 0.1402 9.2200 70.0475 4.3991 14.3281 36.8308 78.4031 72.1447 2.6427 22.6830 23.8356 8.7913 57.5193 0.5252 55.2319 4.4508 124.8336 22.8855 42.7428 4.6619 2.1178 3.0988 4.9737 2.8641 23.8665 13.2812 65.2332 51.6478 42.3318 1.8484 34.0655 23.5316 19.5635 5.1426 5.9684 0.0098 0.0065 0.0887 0.0217 22.0652 6.2797 108.4195 57.4448 20.5920 82.9623 54.1214 16.3524 239.5815 216.7240 140.2965 29.2735 116.6720 100.2215 143.6084 104.7178 2.1143 89.8496 10.4272 15.2647 15.9964 17.8388 200.8728 114.1679 51.5183 80.7912 9.6999 283.6030 5.5147 2.2856 3.1128 1.5065 16.5199 0.1637 80.4398 62.4344 667.4781 232.9256 11.8852 74.4705 73.8355 86.4564 79.9540 40.3079 0.2916 16.5577 7.8697 14.1702 2.0529 2.4676 2.0407 12.4764 23.7548 8.0699 5.7864
temp: 298.150 k
press: 1.00000 atm
elementType: 45 6 6 8 6 1 1 1 8 6 6 1 1 1 8 6 8 45 8 6 8 1 8 6 8 1 8 6 8 1 1 6 6 6 6 6 6 1 1 1 1 1 1 1 1
symmnumber: 1
zpe: 848981.0 jmol-1
zpe.correction: 0.323360 hartree
zpe.thermalcorrener: 0.352238 hartree
zpe.thermalcorrenthalpy: 0.353182 hartree
zpe.thermalcorrgfe: 0.264392 hartree
zpe.sumelectzpe: -1553.483285 hartree
zpe.sumelectthermal: -1553.454407 hartree
zpe.sumelectthermalent: -1553.453463 hartree
zpe.sumelectthermalfe: -1553.542253 hartree
dipole: -7.9746 -0.5326 1.0947
dipole: 8.0670
quadrupole: -176.3983 -162.7835 -175.5916
quadrupole: 9.1960 -5.7312 0.8408
quadrupole: -4.8072 8.8076 -4.0004 9.1960 -5.7312 0.8408
hfenergy: -1553.8066448 hartree
pointgroup: C01 [X(C15H18O10Rh2)]
dipole: -3.1382912 -0.1357057 0.4535571 debye
polarizability: 362.4079219|9.029696|265.9514375|-9.6917149|6.9780533|221.1230367 unknown
InChI: InChI=1S/C11H14O2.4CHO2.2Rh/c1-3-10(11(12)13-2)14-9-7-5-4-6-8-9;4*2-1-3;;/h3-7,9H,1,8H2,2H3;4*1H;;/q;4*-2;2*+4
charge 0 multiplicity 1
45 atoms
Rh -0.06128101 0.02962685 0.01340394
C  -2.02289568 0.64954349 0.25480669
C  -2.35819101 1.91491086 -0.46963787
O  -1.99524013 2.97658559 0.27578713
C  -1.96514657 4.2325079 -0.42415676
H  -1.24764943 4.17637964 -1.2468514
H  -1.64657403 4.96791601 0.31484106
H  -2.9541172 4.4816226 -0.81880721
O  -2.82438151 1.99740531 -1.59105055
C  -2.71479088 0.32678954 1.48232743
C  -3.85643323 0.9298254 1.88202797
H  -4.35963026 0.63646836 2.79981829
H  -4.28717776 1.76204851 1.33334196
H  -2.31694837 -0.51330209 2.0464904
O  -0.35487287 -0.75148401 -1.89497332
C  0.64471742 -1.27548877 -2.4863863
O  1.82314105 -1.41443734 -2.06999436
Rh 2.30674361 -0.69088186 -0.17237827
O  1.69626619 -2.4989061 0.68326608
C  0.48764049 -2.64785492 0.99270342
O  -0.48313806 -1.83357886 0.84657937
H  0.21584483 -3.61182686 1.45088445
O  2.70118466 1.17355012 -1.00446423
C  1.7457141 1.98221577 -1.14493959
O  0.5209126 1.83568314 -0.83523845
H  1.9951128 2.95442946 -1.59689433
O  2.5936799 0.09659352 1.72990489
C  1.60499185 0.61324311 2.31591086
O  0.40765615 0.7384153 1.90641285
H  1.7922628 1.01408935 3.32374522
H  0.4351085 -1.65839676 -3.49719409
C  -3.40929399 -0.91144388 -1.36703263
C  -3.02387344 -2.35949878 -1.11704119
C  -3.67175779 -2.9445597 0.10167131
C  -4.7791743 -2.393825 0.63940896
C  -5.36102212 -1.19147928 0.06604045
C  -4.73698322 -0.50573377 -0.93353809
H  -5.15116794 0.41575498 -1.32947358
H  -6.32685331 -0.85468533 0.43449767
H  -5.26257537 -2.84452966 1.50191108
H  -1.9365899 -2.44989519 -1.06770116
H  -3.25087934 -3.8586477 0.51190269
H  -3.33756848 -2.94967577 -1.99823588
H  -2.63126813 -0.28177285 -0.62296745
H  -3.06829662 -0.50246134 -2.31598947
