program: Gaussian 16
title: wamser cis sm 631g
version: ES64L-G16RevA.03
frameworkgroup: C1[X(C15H18O10Rh2)]
method: RB3LYP
basis: GenECP
operation: Freq
keyword: #NGeom=AllCheck
keyword: Guess=TCheck
keyword: SCRF=Check
keyword: GenChk
keyword: RB3LYP/GenECP
keyword: Freq
converged: YES YES YES YES
title: Mulliken charges:
elementType: Rh C C O C H H H O C C H H H O C O Rh O C O H O C O H O C O H H C C C C C C H H H H H H H H
charge: 0.466096 -0.310825 0.640817 -0.437571 -0.217519 0.168405 0.162666 0.186762 -0.425930 -0.038347 -0.306022 0.154913 0.209947 0.171696 -0.458912 0.433685 -0.448781 0.498952 -0.445660 0.434189 -0.472285 0.135545 -0.454409 0.441161 -0.454069 0.146380 -0.455409 0.439465 -0.445839 0.144883 0.140197 -0.283567 -0.337461 -0.069167 -0.119811 -0.103155 -0.082540 0.152042 0.149288 0.140024 0.227106 0.145759 0.176541 0.197047 0.203715
chargesum: -0.00000
title: Mulliken charges with hydrogens summed into heavy atoms:
elementType: Rh C C O C O C C O C O Rh O C O O C O O C O C C C C C C
charge: 0.466096 -0.310825 0.640817 -0.437571 0.300314 -0.425930 0.133348 0.058837 -0.458912 0.573882 -0.448781 0.498952 -0.445660 0.569734 -0.472285 -0.454409 0.587540 -0.454069 -0.455409 0.584347 -0.445839 0.117195 0.066186 0.076592 0.020213 0.046133 0.069502
chargesum: 0.00000
1716.lowfreq: -450.7688 -5.3586 -0.0004 0.0006 0.0008 3.6492 5.9985 31.5947 39.7863
frequency: -450.7687 31.5839 39.7735 51.3497 64.0271 74.8198 79.0004 84.7912 96.5328 119.4621 124.0168 134.8828 135.8020 143.3962 145.8927 150.5236 154.7058 158.6305 166.4858 177.5585 184.9016 195.0426 209.3557 237.1333 250.0919 257.6330 261.6332 267.4751 291.8913 302.9730 306.3821 343.1677 362.4866 363.5793 370.3581 374.1987 382.9955 398.5740 405.5512 409.5857 409.9853 435.0246 436.0757 444.2866 455.7806 467.7072 516.0023 580.0308 589.5380 623.1546 681.0174 703.5293 770.1912 786.5481 788.2809 809.6087 812.6308 820.0293 841.8669 870.7872 910.6404 957.6118 979.9975 986.4749 989.6774 995.6904 1000.6417 1006.4184 1016.2839 1021.0035 1035.6872 1038.1170 1038.2960 1039.0477 1094.2608 1126.6428 1145.7398 1183.7648 1191.6870 1207.7659 1215.0130 1224.5372 1230.2510 1266.9376 1323.7678 1352.5820 1365.3234 1366.7093 1370.1925 1374.7647 1376.6264 1382.2272 1407.6474 1408.1453 1410.0426 1411.9383 1435.2040 1457.2066 1467.8092 1472.1972 1490.5302 1503.4102 1511.6652 1523.0780 1598.8492 1601.5513 1615.3802 1632.7284 1650.7640 1697.4986 1698.8496 1776.6141 2971.3617 3051.2426 3053.3118 3063.8574 3066.0046 3071.0079 3133.9956 3148.1005 3155.4718 3160.4232 3178.9817 3180.1625 3183.6873 3192.5221 3205.9699 3213.1210 3276.7163
redmass: 2.3704 5.0728 5.3710 3.9990 6.8043 6.6871 5.9235 8.9523 6.7570 4.2607 5.2272 4.2213 4.4952 4.8713 2.1103 2.2915 5.5259 5.5558 6.3654 7.5287 5.0086 4.8070 11.8951 3.0897 5.1321 11.9701 18.4068 4.9654 2.1906 2.4954 14.0382 5.3769 5.8985 5.0760 6.7034 2.9576 9.7954 3.1168 3.7410 7.7949 8.3607 6.2605 6.4294 9.2475 7.6730 4.6372 2.4388 3.5298 5.6242 1.5138 2.7110 1.5028 5.4457 11.9085 11.1838 9.9748 1.4391 11.6972 1.6108 3.7892 3.5701 1.9230 1.3774 1.5344 2.0449 3.1894 1.7878 2.6603 1.6358 1.3018 1.6408 1.6353 1.6279 1.6300 3.0026 1.5198 1.4056 1.2845 1.1181 1.9418 1.1367 1.4802 1.2955 1.1961 2.0656 1.7923 6.9057 7.2403 8.2614 5.5724 1.4683 1.6421 1.1533 1.1527 1.1815 1.1684 1.3555 1.3050 1.4302 1.2412 1.2303 1.5350 1.0489 1.0475 9.7601 9.0678 4.1047 9.0927 3.1878 6.9222 5.9911 10.9890 1.0741 1.0856 1.0860 1.0863 1.0864 1.0297 1.0846 1.1073 1.0839 1.0862 1.0647 1.1076 1.0853 1.0870 1.0952 1.0983 1.1169
irintensity: 1117.8640 0.4624 0.2092 1.1387 0.8708 0.3952 0.6883 0.4888 0.9817 0.8297 1.5248 0.2800 10.8856 3.5064 1.4146 2.2904 2.5541 0.0347 0.1840 0.6888 7.3336 3.7693 1.1547 1.9065 1.2395 0.1525 1.4537 34.3996 23.2664 0.0568 9.8342 21.7907 3.4269 5.9051 0.6803 0.2309 4.7740 11.8466 7.3902 10.2544 3.7239 78.6012 68.2321 1.9856 20.5951 59.0693 22.9467 2.2540 0.2864 176.2879 13.4253 129.5184 28.8849 37.2913 34.1199 0.4254 1.6451 5.1023 0.7029 17.7808 4.9160 84.0374 11.3268 4.6481 2.3710 6.4274 6.2509 4.8828 174.3198 7.6744 0.0664 0.0452 0.0309 0.0273 94.9379 29.6466 385.4546 2.5173 15.0001 124.4536 26.0070 26.5389 87.5393 21.0115 293.7859 61.1940 98.9097 170.2210 101.8885 76.9240 6.6640 8.7095 4.6430 22.0449 13.9664 25.5566 87.6826 149.4077 50.5403 8.8391 11.2788 116.6531 8.6694 7.3667 4.0903 3.0141 11.4401 0.4002 25.1761 467.6430 252.1256 230.8046 12.5031 66.3686 75.5549 78.3059 79.3242 40.5291 3.0303 15.9806 5.4228 1.5641 12.5007 13.6267 0.7750 4.8176 21.1744 22.8275 2.6461
temp: 298.150 k
press: 1.00000 atm
elementType: 45 6 6 8 6 1 1 1 8 6 6 1 1 1 8 6 8 45 8 6 8 1 8 6 8 1 8 6 8 1 1 6 6 6 6 6 6 1 1 1 1 1 1 1 1
symmnumber: 1
zpe: 849598.3 jmol-1
zpe.correction: 0.323595 hartree
zpe.thermalcorrener: 0.352366 hartree
zpe.thermalcorrenthalpy: 0.353310 hartree
zpe.thermalcorrgfe: 0.265032 hartree
zpe.sumelectzpe: -1553.481579 hartree
zpe.sumelectthermal: -1553.452808 hartree
zpe.sumelectthermalent: -1553.451864 hartree
zpe.sumelectthermalfe: -1553.540142 hartree
dipole: -7.8956 -1.4147 -1.4858
dipole: 8.1578
quadrupole: -175.6249 -170.9624 -172.0157
quadrupole: 11.5852 2.9082 -10.3106
quadrupole: -2.7573 1.9053 0.8520 11.5852 2.9082 -10.3106
hfenergy: -1553.8051741 hartree
pointgroup: C01 [X(C15H18O10Rh2)]
dipole: -3.0933919 -0.7254267 -0.4535859 debye
polarizability: 337.9701364|19.5948127|271.3776386|-11.2647085|-2.8922972|237.431135 unknown
InChI: InChI=1S/C11H14O2.4CHO2.2Rh/c1-3-10(11(12)13-2)14-9-7-5-4-6-8-9;4*2-1-3;;/h3-7,9H,1,8H2,2H3;4*1H;;/q;4*-2;2*+4
charge 0 multiplicity 1
45 atoms
Rh 0.1444016 0.21252702 0.06581733
C  -1.75616963 1.04817829 0.40781377
C  -1.90595767 2.37133232 -0.27209851
O  -2.01701851 2.27892371 -1.61155199
C  -1.91984159 3.5283998 -2.31464812
H  -2.70866326 4.21697692 -1.99795853
H  -2.02637913 3.27769235 -3.37041006
H  -0.94548429 3.9852177 -2.12220167
O  -1.85426451 3.42423597 0.3345875
C  -2.39741148 0.96937511 1.69964774
C  -2.51767237 -0.18533489 2.39151461
H  -3.04063028 -0.21686522 3.3431227
H  -2.08293389 -1.10732512 2.02075625
H  -2.84458596 1.88482326 2.08666062
O  -0.1063639 -0.07102136 -1.9892613
C  0.87899329 -0.52160613 -2.65777484
O  2.02248166 -0.85554368 -2.25317805
Rh 2.45611379 -0.65605718 -0.22429948
O  1.6727991 -2.55736016 0.1402359
C  0.44385081 -2.66544622 0.37810921
O  -0.4464359 -1.75468154 0.41392733
H  0.07162125 -3.68218396 0.57964355
O  3.05139153 1.30437375 -0.56040623
C  2.17085923 2.20543508 -0.54028104
O  0.92241666 2.09687674 -0.32728497
H  2.51926516 3.23134582 -0.73262269
O  2.72016999 -0.38244134 1.81545568
C  1.75595132 0.0830772 2.48098145
O  0.59661699 0.41623812 2.08147383
H  1.93171403 0.2214069 3.55856557
H  0.69343908 -0.6335194 -3.73758437
C  -3.46721307 -0.41019255 -1.02705992
C  -2.86420357 -1.69490998 -1.58133687
C  -2.95550978 -2.86622872 -0.6520297
C  -3.82400151 -2.8855418 0.37968999
C  -4.66952731 -1.73754407 0.64309801
C  -4.53691675 -0.57361179 -0.05305217
H  -5.1665814 0.27903821 0.18445809
H  -5.43936761 -1.82314137 1.40611315
H  -3.90969986 -3.75677726 1.0228859
H  -1.83176431 -1.51706989 -1.89077952
H  -2.33232945 -3.72951391 -0.86908392
H  -3.41538747 -1.95057757 -2.50495111
H  -2.53479475 0.1387236 -0.39711113
H  -3.628624 0.35743437 -1.78397703
