program: Gaussian 16
title: test
version: ES64L-G16RevC.01
method: UPBE1PBE
basis: def2SVP
operation: Freq
keyword: #N
keyword: Geom=AllCheck
keyword: Guess=TCheck
keyword: SCRF=Check
keyword: GenChk
keyword: UPBE1PBE/def2SVP
keyword: Freq
converged: YES YES YES YES
1716.lowfreq: -295.5446 -4.7999 -0.0012 -0.0008 0.0005 5.6854 6.9710 12.6640 16.2716
temp: 298.150 k
press: 1.00000 atm
elementType: 6 6 6 6 6 6 7 7 6 8 6 8 1 1 15 15 1 1 1 1 1 1 1 1 1 1 6 6 6 6 6 6 1 1 1 1 1 6 6 6 6 6 6 1 1 1 1 1 6 6 6 6 6 6 1 1 1 1 1 6 6 6 6 6 6 1 1 1 1 1 46 6 6 6 1 1 6 6 6 6 1 6 6 6 1 6 1 6 6 1 1 1 6 6 6 6 1 6 6 6 1 6 1 6 6 1 1 1 1 1 6 6 6 6 1 6 1 6 1 1 1 6 6 6 6 1 1 1 1 7 7 16 1 1 6 6 6 6 1 6 1 6 1 1 1 8
symmnumber: 1
zpe: 3117457.4 jmol-1
zpe.correction: 1.187377 hartree
zpe.thermalcorrener: 1.258634 hartree
zpe.thermalcorrenthalpy: 1.259578 hartree
zpe.thermalcorrgfe: 1.077023 hartree
zpe.sumelectzpe: -4389.869765 hartree
zpe.sumelectthermal: -4389.798509 hartree
zpe.sumelectthermalent: -4389.797564 hartree
zpe.sumelectthermalfe: -4389.980119 hartree
dipole: 9.8286 2.0699 -1.4739
dipole: 10.1517
quadrupole: -465.1042 -456.0651 -476.0256
quadrupole: 0.6685 17.9086 14.9753
quadrupole: 0.6274 9.6665 -10.2940 0.6685 17.9086 14.9753
hfenergy: -4391.0571421 hartree
pointgroup: C01 [X(C71H64N4O3P2Pd1S1)]
dipole: 3.8556047 0.834883 -0.6239816 debye
polarizability: 1421.4013771|-41.706781|1301.1903609|12.7849303|83.0171248|1163.5145272 unknown
InChI: InChI=1S/C52H44N2O2P2.C10H11N2OS.C9H9.Pd/c55-51(45-33-37-19-13-15-21-39(37)35-49(45)57(41-23-5-1-6-24-41)42-25-7-2-8-26-42)53-47-31-17-18-32-48(47)54-52(56)46-34-38-20-14-16-22-40(38)36-50(46)58(43-27-9-3-10-28-43)44-29-11-4-12-30-44;13-14(10-6-2-1-3-7-10)11-8-4-5-9-12-14;1-8(2)9-6-4-3-5-7-9;/h1-16,19-30,33-36,47-48,53-54H,17-18,31-32H2;1-7H,8-9H2;3-7H,1-2H2;
charge 0 multiplicity 1
146 atoms
C  -3.75501398 -3.10804378 -4.06303399
C  -3.26917263 -4.10169328 -3.01558286
C  -1.79334468 -3.88194894 -2.71681207
C  -1.51426272 -2.45118224 -2.25164202
C  -2.02728366 -1.42519024 -3.2645797
C  -3.49450319 -1.67699008 -3.61430912
N  -0.09084044 -2.25992152 -2.03008341
N  -1.88813552 -0.06501375 -2.78476111
C  0.51511285 -2.72069984 -0.92602869
O  -0.10054476 -3.18367654 0.03146857
C  -0.77774459 0.67310797 -2.95565443
O  0.26382747 0.23374991 -3.44212219
H  0.43823977 -1.72373734 -2.71762056
H  -2.62318949 0.26084196 -2.15762986
P  2.21242391 -1.06565948 1.26304726
P  1.4212511 1.875403 -0.97790966
H  -3.23409601 -3.30061987 -5.01861868
H  -4.83124204 -3.24333708 -4.25764094
H  -3.85484457 -3.97009404 -2.08845931
H  -3.43788459 -5.13732903 -3.35258368
H  -1.43796655 -4.57503536 -1.93836992
H  -1.19432709 -4.07774408 -3.62496601
H  -2.04586481 -2.27519231 -1.30296457
H  -1.4115014 -1.51120075 -4.17770174
H  -3.79599658 -0.95731972 -4.39258759
H  -4.09501075 -1.45753643 -2.71587611
C  4.54266809 0.93954627 -4.2672119
C  3.84800517 2.15059065 -4.29480252
C  2.9042664 2.43938646 -3.31121209
C  2.65131958 1.51834524 -2.28605296
C  3.33950677 0.30414878 -2.27199227
C  4.28504912 0.01526563 -3.25551573
H  5.27938538 0.71332181 -5.04264002
H  4.03755612 2.87388635 -5.0923268
H  2.35535961 3.38426409 -3.3480694
H  3.11865295 -0.43191922 -1.49960575
H  4.81459634 -0.94083637 -3.23488679
C  3.26414531 5.25209685 1.63003677
C  2.07348191 4.62210653 1.99778681
C  1.56122677 3.58964319 1.21832006
C  2.21653058 3.18505668 0.04352467
C  3.41924028 3.80787618 -0.30697135
C  3.93902703 4.83430002 0.48485982
H  3.67188678 6.05913204 2.24446706
H  1.54313348 4.92453835 2.90464998
H  0.64177642 3.08918689 1.53060569
H  3.96187751 3.49674407 -1.20167224
H  4.8816406 5.30841938 0.19902583
C  1.61947904 -3.41328792 5.23643198
C  2.62290644 -2.44875071 5.1668857
C  2.84460741 -1.74342534 3.98228923
C  2.05440272 -1.99203676 2.85318929
C  1.06197973 -2.98340787 2.92097458
C  0.84841947 -3.68582811 4.10482258
H  1.44399393 -3.95868879 6.1674659
H  3.24522965 -2.23838156 6.04085461
H  3.64046079 -0.99755483 3.95263775
H  0.46873025 -3.20925567 2.03007773
H  0.06941905 -4.45215642 4.14172769
C  5.51123489 2.08716441 2.133452
C  5.72712377 1.17281392 1.10510282
C  4.78207232 0.18383924 0.8277259
C  3.60076285 0.10057907 1.57419256
C  3.37145003 1.05785444 2.57814316
C  4.32584601 2.02850739 2.86732812
H  6.25523404 2.85751757 2.35132741
H  6.63977131 1.22316273 0.50567443
H  4.97747907 -0.51341415 0.01299117
H  2.43174097 1.04890968 3.13894936
H  4.13032859 2.7559213 3.65858633
Pd 0.47612967 0.33842968 0.51093022
C  -1.40577855 -0.79356126 1.5655289
C  -1.29955622 0.60105859 1.76439327
C  -1.35461111 1.41072922 0.59607906
H  -1.94456311 1.03822257 -0.24322209
H  -1.3030389 2.49956668 0.67852334
C  2.01657554 -2.82687949 -0.95418946
C  2.56640084 -3.61720066 -1.94110791
C  2.83771531 -2.36305458 0.12219847
C  3.91969988 -4.03980426 -1.88852959
H  1.93673671 -3.96950549 -2.76272519
C  4.13299078 -2.82561941 0.22815046
C  4.50214686 -4.84416357 -2.90104929
C  4.70886566 -3.66717738 -0.75858782
H  4.75802283 -2.52456175 1.07306981
C  5.81065353 -5.26049708 -2.79441538
H  3.89506355 -5.12869155 -3.76471822
C  6.05175559 -4.11654945 -0.67274459
C  6.59071362 -4.89646521 -1.6713004
H  6.25266865 -5.87893074 -3.57986903
H  6.65067878 -3.82797204 0.1952996
H  7.62666004 -5.23763792 -1.60050031
C  -0.90640708 2.12803548 -2.6061534
C  -1.99316538 2.81787719 -3.09912512
C  0.10762626 2.82188511 -1.86772145
C  -2.13305199 4.21838842 -2.92521784
H  -2.76271017 2.28002819 -3.65925652
C  -0.0126887 4.18502502 -1.69681861
C  -3.24357672 4.93989089 -3.43147636
C  -1.11190399 4.91783372 -2.21790855
H  0.73763414 4.73796058 -1.12781922
C  -3.33468912 6.3013552 -3.24259742
H  -4.02501306 4.39783291 -3.97091971
C  -1.23152414 6.31967205 -2.03924204
C  -2.32077098 6.99630027 -2.54238171
H  -4.19454553 6.8513018 -3.63367596
H  -0.44692097 6.85142104 -1.49384962
H  -2.40697866 8.07661046 -2.39965599
H  -1.15917717 -1.4960113 2.3605553
H  -1.52323345 -1.20475921 0.56763376
C  -1.05763885 1.18749557 3.10842614
C  -1.5388486 2.46838357 3.41640809
C  -0.34207169 0.49140364 4.09630238
C  -1.29938515 3.04177128 4.66520829
H  -2.1275851 3.0136054 2.67510216
C  -0.10562754 1.0619397 5.34418768
H  0.05621811 -0.50196224 3.87945357
C  -0.57994737 2.34317426 5.63470819
H  -1.68787753 4.04020745 4.88389598
H  0.46298533 0.50205008 6.09178997
H  -0.39207418 2.79255013 6.61338636
C  -4.0991584 -0.32485773 3.90190562
C  -4.83780941 0.7415246 3.5670178
C  -5.69591243 0.817006 2.32704486
C  -4.0310821 -1.59510276 3.08827499
H  -3.47889887 -0.27217191 4.80492225
H  -4.79682333 1.62933565 4.21001102
H  -6.22343841 1.78368483 2.31591864
H  -5.0392825 -2.06660289 3.08115335
N  -3.50733718 -1.47003927 1.73636063
N  -4.97498589 0.7232259 1.06205251
S  -4.37756298 -0.66107576 0.67604056
H  -3.38053577 -2.31962269 3.60387974
H  -6.49969919 0.04998117 2.41030133
C  -5.73720404 -1.78111163 0.23984649
C  -6.92338964 -1.23601663 -0.25118737
C  -5.55831692 -3.16332958 0.30865913
C  -7.94264484 -2.08634502 -0.67954626
H  -7.0313792 -0.14893017 -0.29442887
C  -6.58109082 -4.00770771 -0.12239469
H  -4.61783365 -3.56020025 0.69892077
C  -7.77133723 -3.47048068 -0.61745993
H  -8.8753022 -1.66593298 -1.06530228
H  -6.44716248 -5.09170338 -0.07338347
H  -8.57150738 -4.13500793 -0.95416234
O  -3.59199436 -0.53894138 -0.57811347
