program: Gaussian 09
title: 000007024
version: EM64L-G09RevD.01
frameworkgroup: C1[X(C7H4Br2O2)]
method: RPBEPBE
basis: SDD
operation: Freq
keyword: #p
keyword: freq=noraman
keyword: PBEPBE/SDD
title: #p freq=noraman PBEPBE/SDD
converged: NO YES NO NO
title: Mulliken charges:
elementType: Br Br O O C C C C C C C H H H H
charge: 0.080469 0.038841 -0.369749 -0.276707 0.273474 0.296191 -0.310052 -0.364268 -0.225008 -0.124955 -0.153856 0.260181 0.277833 0.210946 0.386661
chargesum: 0.00000
title: Mulliken charges with hydrogens summed into heavy atoms:
elementType: Br Br O O C C C C C C C
charge: 0.080469 0.038841 0.016912 -0.276707 0.273474 0.296191 -0.049871 -0.364268 -0.225008 0.152878 0.057090
polarizability: 1.68371102e+02 -2.77535753e+00 1.46370637e+02 -1.09145114e-02 -1.52338030e-02 3.86023339e+01
1716.lowfreq: -5.8785 -4.9727 -0.0006 -0.0006 -0.0004 4.5861 99.0984 101.5426 117.4700
frequency: 99.0981 101.5418 117.4686 156.2029 175.2093 249.7897 290.3267 296.9423 325.3952 342.2009 430.1540 485.8415 494.7796 557.1282 654.4765 686.9494 740.3940 803.5844 872.9816 896.0061 899.1496 915.0454 966.9440 1092.4868 1153.5498 1227.8219 1264.9825 1335.9515 1354.9037 1389.6526 1400.7404 1416.9341 1545.9431 1554.4292 1619.7657 2829.6637 2985.4622 3154.5274 3178.5664
redmass: 6.6727 12.2742 25.7724 12.9408 5.4061 20.8498 3.0666 8.4203 8.4396 6.0519 7.7539 4.1610 5.6877 3.4787 9.8394 7.3025 6.0378 6.9238 1.4412 1.3887 6.7031 1.1263 1.5967 1.9885 2.8526 1.7379 3.1691 1.4863 1.9537 4.1641 4.7976 3.3606 3.6206 6.4249 4.5025 1.0716 1.0895 1.0928 1.0932
irintensity: 2.7876 0.0180 0.0482 1.4783 0.9630 0.7814 3.2706 9.5537 3.0090 1.4601 0.7996 2.5489 15.3793 9.9024 81.1750 39.6319 15.9160 9.5991 28.5406 7.3111 8.4347 112.0490 31.5467 2.1555 82.7205 140.6812 21.6873 237.2379 49.1937 59.0093 14.6740 210.2643 13.3754 86.9902 115.7624 274.0472 45.3935 0.5454 0.4410
temp: 298.150 k
press: 1.00000 atm
elementType: 35 35 8 8 6 6 6 6 6 6 6 1 1 1 1
symmnumber: 1
zpe: 239629.9 jmol-1
zpe.correction: 0.091270 hartree
zpe.thermalcorrener: 0.101350 hartree
zpe.thermalcorrenthalpy: 0.102294 hartree
zpe.thermalcorrgfe: 0.053360 hartree
zpe.sumelectzpe: -445.722185 hartree
zpe.sumelectthermal: -445.712106 hartree
zpe.sumelectthermalent: -445.711162 hartree
zpe.sumelectthermalfe: -445.760095 hartree
dipole: 2.5587 0.5527 -0.0007
dipole: 2.6177
quadrupole: -88.9189 -79.0403 -83.6439
quadrupole: 7.1819 -0.0027 0.0131
quadrupole: -5.0512 4.8274 0.2238 7.1819 -0.0027 0.0131
hfenergy: -445.8134556 hartree
pointgroup: C01 [X(C7H4Br2O2)]
dipole: 0.5834472 -0.8486098 0.0100202 debye
dipolederiv: 0.0058575 0.0036878 -0.0001439 0.0498637 -0.6433562 0.0032118 -0.0004429 0.0024821 0.0201549 -0.5757103 0.2480288 -0.0069014 0.2698111 -0.166832 0.0034554 -0.0070688 0.0033308 -0.0118941 -1.1168026 0.3677361 -0.0105446 0.2523127 -0.4402771 0.0035677 -0.0102065 0.005279 -0.3629835 -1.303031 -0.3425367 -0.0075963 0.2047949 -0.3718768 0.0021059 -0.0094676 -0.0027367 -0.3432402 -0.8385289 -0.6059 -0.0054184 -0.3760197 -0.4178246 -0.0010838 -0.0063771 -0.0035574 -0.0085098 1.0400153 -0.4531389 0.0127897 -0.1239801 -0.0691976 -0.0011167 0.0111147 -0.0047186 0.1678734 0.0862877 0.5132988 -0.0007691 0.063458 -0.0475099 0.0006084 0.0014902 0.0054454 -0.0670687 -0.3379065 0.213647 -0.0030338 -0.1144835 1.2866237 -0.0069745 -0.0012224 -0.0031384 -0.1750998 0.9594324 -0.6844694 0.0147512 -0.6906807 -0.0931866 -0.0071756 0.0146253 -0.0074257 -0.1575968 -0.1946908 0.0592336 -0.0020993 0.1972906 -0.0667786 0.0020857 -0.0028036 0.0006261 0.016088 1.5780609 0.6043316 0.0105462 0.3310718 0.7496965 -0.0004242 0.0108598 0.0019034 0.1189352 0.1070958 -0.0248809 -0.0004558 0.0225054 -0.0236591 0.0010731 -0.0006894 0.0005548 0.1628933 0.0547569 -0.0511181 -0.0008737 -0.0437044 0.0833445 -0.0002249 -0.0009317 -0.0002865 0.1518239 0.0579778 0.1008278 -0.0011325 -0.0194624 -0.1847465 0.0015769 -0.0004352 0.0027447 0.1207742 0.4771857 0.0512527 0.0008818 -0.0227772 0.4055804 -0.000685 0.0015552 -0.000503 0.3678499 unknown
polarizability: 160.7805222|-10.8099435|153.9448936|1.3046506|-0.6388779|38.6186576 unknown
InChI: InChI=1S/C7H4Br2O2/c8-5-1-4(3-10)7(11)6(9)2-5/h1-3,11H
charge 0 multiplicity 1
15 atoms
Br 0.318964 3.315485 -0.023996
Br 3.539516 -1.511622 0.029824
O  -1.979449 1.233263 -0.042911
O  -3.049123 -1.100102 -0.037216
C  -0.656083 -0.827064 -0.018183
C  -0.764601 0.610985 -0.025956
C  0.619756 -1.459269 -0.001165
C  0.434574 1.377663 -0.015697
C  1.772243 -0.669013 0.007535
C  1.69121 0.748844 0.000527
C  -1.878542 -1.623838 -0.024157
H  0.68159 -2.552257 0.004636
H  2.60155 1.353818 0.008244
H  -1.773997 -2.728878 -0.016095
H  -2.709309 0.503186 -0.045791
