program: Gaussian 09
title: 000045862
version: EM64L-G09RevD.01
frameworkgroup: C1[X(C12H16ClNO)]
method: RPBEPBE
basis: SDD
operation: Freq
keyword: #p
keyword: freq=noraman
keyword: PBEPBE/SDD
title: #p freq=noraman PBEPBE/SDD
converged: YES YES NO NO
title: Mulliken charges:
elementType: Cl O N C C C C C C C C C C C C H H H H H H H H H H H H H H H H
charge: -0.056816 -0.423468 -0.074666 -0.185722 -0.466053 -0.412773 0.468665 -0.563721 0.142522 -0.339434 0.091757 -0.640568 -0.633152 -0.226931 -0.377268 0.242014 0.227089 0.209562 0.216124 0.206840 0.200905 0.237884 0.245705 0.179156 0.226044 0.221463 0.191456 0.227559 0.254995 0.255507 0.355321
chargesum: 0.00000
title: Mulliken charges with hydrogens summed into heavy atoms:
elementType: Cl O N C C C C C C C C C C C C
charge: -0.056816 -0.068147 -0.074666 0.056293 -0.029401 0.010191 0.468665 -0.124932 0.142522 -0.339434 0.091757 0.010337 0.007327 0.028064 -0.121761
polarizability: 1.76486784e+02 -4.61720977e+00 1.59636517e+02 9.87408362e+00 1.94546782e+00 9.85264199e+01
1716.lowfreq: -10.6394 0.0014 0.0023 0.0026 1.0612 7.0535 42.7637 58.5993 76.4269
frequency: 42.6448 58.4579 76.4104 113.0599 131.2730 166.0282 205.8862 216.2122 238.4310 276.2410 290.1409 295.6089 305.3434 318.1247 339.7247 361.1255 372.7645 423.9507 443.8339 479.7860 513.6894 528.8562 559.9409 586.9303 644.8769 678.8702 758.4140 796.3776 815.4713 818.8091 876.7658 883.5065 910.5690 942.1853 952.2134 1023.9772 1034.7078 1048.6526 1069.5861 1088.3084 1100.2896 1118.6851 1134.5074 1137.2960 1142.6854 1174.5087 1180.3274 1198.3106 1216.9854 1264.3005 1269.3097 1288.4682 1312.0360 1323.5065 1331.2450 1352.5698 1353.0571 1383.4019 1419.3258 1425.2497 1436.7612 1440.1879 1454.5750 1457.1689 1466.9128 1472.4667 1474.1105 1483.2950 1494.7373 1581.7664 1608.6892 2837.1093 2854.3204 2937.4920 2972.0819 2978.6446 2981.9174 2993.8379 3003.4629 3010.3018 3041.8776 3051.3955 3064.4167 3073.7332 3161.2245 3181.9955 3577.4071
redmass: 3.5610 2.5512 3.4838 6.3186 3.1506 3.7457 1.2728 1.6699 1.4346 3.6348 2.9293 2.0750 1.9798 3.7670 2.0857 4.1616 5.4621 3.0847 3.6305 3.3388 3.6806 3.8506 3.0949 4.4321 4.8185 3.8221 5.6742 3.7161 1.5881 2.4152 3.1233 1.7369 2.3950 1.3405 2.7358 2.3562 2.3208 1.5646 1.9254 1.2795 2.1827 2.3280 1.3984 1.3490 1.2404 1.8230 1.6211 2.2613 2.0679 1.4269 2.0412 2.2270 1.4424 1.5621 1.4029 1.4563 1.5796 3.5194 1.1385 3.7759 2.8147 1.1922 1.0981 1.1127 1.0743 1.0847 1.0843 1.0607 1.0548 7.5421 7.2680 1.0581 1.0581 1.0583 1.0834 1.0841 1.0635 1.0756 1.0715 1.0702 1.0987 1.1038 1.1004 1.0997 1.0885 1.0977 1.0652
irintensity: 0.0404 0.3009 0.0634 0.2495 0.2014 1.9077 0.3494 1.3300 1.4938 8.6358 13.2849 10.1868 44.2379 23.6377 38.8521 6.0129 6.1051 2.6235 4.0825 5.3331 10.3667 0.3637 12.0032 3.5302 17.7561 7.5061 4.2708 15.8695 36.9857 16.1581 17.6216 6.2971 6.7011 0.0782 17.9535 28.6747 25.6219 10.7781 12.0389 9.8071 0.3907 25.5297 12.0720 150.1311 10.7822 56.1506 5.0187 26.3348 40.2814 3.2151 5.7325 2.2478 4.3388 12.9473 4.4730 11.5225 1.9604 11.3822 8.5682 9.2635 120.5006 2.6841 5.9067 11.2508 11.5521 19.1695 1.7028 6.6521 8.2027 15.6104 0.1874 78.2843 195.0787 41.8606 11.2699 8.9515 39.1081 66.5538 42.2298 37.8642 47.7802 47.6299 32.7904 32.9158 1.7110 5.4845 27.2568
temp: 298.150 k
press: 1.00000 atm
elementType: 17 8 7 6 6 6 6 6 6 6 6 6 6 6 6 1 1 1 1 1 1 1 1 1 1 1 1 1 1 1 1
symmnumber: 1
zpe: 669344.8 jmol-1
zpe.correction: 0.254940 hartree
zpe.thermalcorrener: 0.269889 hartree
zpe.thermalcorrenthalpy: 0.270833 hartree
zpe.thermalcorrgfe: 0.213221 hartree
zpe.sumelectzpe: -1055.753758 hartree
zpe.sumelectthermal: -1055.738808 hartree
zpe.sumelectthermalent: -1055.737864 hartree
zpe.sumelectthermalfe: -1055.795477 hartree
dipole: -0.1011 -3.6261 -0.0094
dipole: 3.6275
quadrupole: -98.0706 -91.1394 -97.4571
quadrupole: -0.2814 -0.4725 1.1235
quadrupole: -2.5149 4.4163 -1.9014 -0.2814 -0.4725 1.1235
hfenergy: -1056.0086977 hartree
pointgroup: C01 [X(C12H16Cl1N1O1)]
dipole: -0.3014092 -1.3672764 0.2766712 debye
polarizability: 173.6263591|-4.6787322|159.1496432|13.4150987|-12.7940031|101.8737185 unknown
InChI: InChI=1S/C12H16ClNO/c1-14(2)10-5-3-4-8-11(15)7-6-9(13)12(8)10/h6-7,10,15H,3-5H2,1-2H3
charge 0 multiplicity 1
31 atoms
Cl -0.959409 2.629522 -1.331713
O  3.434911 -0.882575 0.805358
N  -2.335309 0.361225 0.429134
C  -1.436964 -0.367826 -0.510121
C  -1.564401 -1.923538 -0.399724
C  -0.261373 -2.666471 -0.74271
C  -0.000831 0.154316 -0.348254
C  0.855857 -2.193334 0.21268
C  1.064342 -0.686918 0.090258
C  0.301649 1.512487 -0.613512
C  2.346866 -0.120747 0.334426
C  -2.081692 0.172723 1.862862
C  -3.7557 0.3362 0.06006
C  1.575827 2.06666 -0.390306
C  2.605717 1.246083 0.107587
H  -1.771367 -0.061876 -1.522721
H  -2.390854 -2.267845 -1.04813
H  -1.845539 -2.186201 0.639635
H  0.039712 -2.459965 -1.788395
H  -0.407708 -3.759508 -0.649297
H  1.792829 -2.734605 -0.03993
H  0.588831 -2.480696 1.2517
H  -1.005079 0.297142 2.073683
H  -2.402165 -0.821574 2.268693
H  -2.627012 0.949123 2.430854
H  -4.306853 1.073437 0.673249
H  -4.255068 -0.655989 0.202278
H  -3.868845 0.627882 -1.000308
H  1.760975 3.122589 -0.605374
H  3.606113 1.641105 0.303633
H  3.169941 -1.823226 0.958804
