program: Gaussian 09
title: 000045885
version: EM64L-G09RevD.01
frameworkgroup: C1[X(C19H21Cl2NO)]
method: RPBEPBE
basis: SDD
operation: Freq
keyword: #p
keyword: freq=noraman
keyword: PBEPBE/SDD
title: #p freq=noraman PBEPBE/SDD
converged: YES YES NO NO
title: Mulliken charges:
elementType: Cl Cl O N C C C C C C C C C C C C C C C C C C C H H H H H H H H H H H H H H H H H H H H H
charge: -0.055622 -0.068976 -0.299554 -0.076874 -0.188944 -0.462592 -0.413442 0.463137 -0.543316 0.094095 0.231106 -0.332041 -0.632909 -0.639541 -0.379481 -0.262496 -0.381102 0.410861 -0.374226 -0.392613 -0.078033 -0.208578 -0.245408 0.240592 0.222770 0.207982 0.210271 0.207257 0.251471 0.225584 0.220114 0.193362 0.227314 0.244704 0.181850 0.224030 0.253451 0.252209 0.226582 0.225195 0.296526 0.232678 0.234000 0.258605
chargesum: 0.00000
title: Mulliken charges with hydrogens summed into heavy atoms:
elementType: Cl Cl O N C C C C C C C C C C C C C C C C C C C
charge: -0.055622 -0.068976 -0.299554 -0.076874 0.051648 -0.031840 0.004086 0.463137 -0.066261 0.094095 0.231106 -0.332041 0.007881 0.011043 -0.126030 -0.010286 0.070675 0.410861 -0.077700 -0.159935 -0.078033 0.025422 0.013197
polarizability: 3.19394109e+02 -6.68928766e-01 2.52395176e+02 8.06227391e-01 -5.89002173e+00 1.30919199e+02
1716.lowfreq: -8.7411 -2.6046 -0.0024 -0.0023 -0.0019 7.1733 11.1532 22.6208 35.8951
frequency: 9.5518 22.5887 35.8861 39.6893 66.5842 74.2577 95.4231 123.2020 123.4710 138.1841 164.3185 175.1907 200.2955 211.5635 217.6174 226.8662 241.0786 274.0791 288.5206 300.0016 321.3881 342.5780 361.8383 369.4221 388.4185 421.7715 433.8469 436.5680 455.5338 485.2186 517.8801 525.2236 535.9364 558.7296 595.9615 604.7297 652.5775 670.8272 685.2880 709.6867 765.0464 779.2237 795.0918 797.5332 817.4701 865.1665 869.8519 878.4307 890.5530 907.3816 909.3915 920.2883 937.2242 975.5329 985.3707 995.4777 1018.5429 1022.4974 1045.2756 1055.5188 1071.9724 1075.0625 1091.0490 1091.8350 1102.2549 1135.8406 1140.1139 1147.4633 1173.4556 1177.9525 1182.6186 1196.7827 1207.1278 1212.7117 1215.5563 1240.2181 1258.9974 1266.2167 1277.8442 1313.0813 1324.4244 1330.8744 1342.0134 1352.3149 1353.3721 1377.3546 1388.4957 1418.2543 1420.6812 1423.4284 1438.8453 1442.2964 1457.7106 1465.0553 1465.7335 1469.1990 1471.1985 1473.3948 1475.6011 1483.9354 1495.5677 1575.5862 1581.9140 1594.3381 1613.2555 2843.8709 2860.5965 2935.6706 2962.7568 2973.1245 2980.4870 2982.3574 2988.3056 3004.7730 3011.9785 3037.5117 3045.8145 3054.3733 3065.0481 3075.5842 3123.6336 3151.0937 3158.9866 3175.2620 3178.6459 3192.0351
redmass: 6.7922 4.7711 6.8698 3.8241 3.1710 2.7084 4.7169 6.6781 5.0249 4.2205 4.4822 4.9153 4.3344 1.3040 2.8871 1.9651 1.2520 4.6308 2.7323 3.2966 3.6452 3.8772 5.5017 3.6942 8.9295 4.8375 2.9786 3.2575 3.8134 3.3221 3.9483 3.9503 3.6850 4.7416 4.3461 3.8077 4.8223 5.8176 2.5068 4.9281 5.3203 1.3588 3.7507 1.4457 2.9896 4.0593 4.3283 1.5705 1.3388 2.5085 1.3711 1.3434 2.9803 1.3380 5.9573 3.8132 1.7393 2.3614 1.5172 2.6037 2.0614 2.1223 1.5475 1.3654 2.1916 1.4200 1.4630 1.9549 1.5653 1.0929 1.6330 2.2561 2.1230 1.3551 1.5041 3.5334 1.3085 2.4011 1.3041 1.3511 1.6014 1.3874 1.6636 1.5282 1.6760 4.9701 4.1557 3.6885 1.1384 2.4526 1.1859 2.2614 1.0632 1.4416 1.3986 1.1244 1.0994 1.0977 1.2606 1.0593 1.0555 6.6194 6.7562 8.6547 6.6130 1.0577 1.0573 1.0556 1.0684 1.0835 1.0593 1.0629 1.1045 1.0723 1.0706 1.0987 1.1006 1.0950 1.1005 1.0995 1.0885 1.0924 1.0877 1.0977 1.0965 1.0926
irintensity: 0.5194 0.0724 0.3424 0.0968 1.4546 0.5986 0.3340 1.9974 0.6116 4.6461 1.1740 0.8165 1.3829 0.3728 4.5404 0.8682 0.7052 1.6798 1.1434 0.6675 4.9983 0.8429 1.9370 3.0088 8.2426 4.2637 4.6062 2.8084 1.3044 5.3665 0.4771 4.3470 0.5805 1.1864 5.5387 1.7239 11.7584 17.8209 21.2798 29.4760 9.9796 41.4841 20.8961 67.2276 11.4217 3.1727 34.3242 10.4018 6.6411 21.2166 6.9177 0.1369 5.5718 0.2454 2.0782 57.4395 1.0220 60.1120 0.3717 54.9568 31.8101 49.6492 9.2112 1.6943 30.6159 5.0434 0.4049 14.9898 1.8788 3.7868 61.9623 13.2000 4.4129 5.0306 6.3679 291.6241 6.8839 4.7618 5.6892 16.0034 16.5025 4.9939 5.8059 8.6251 16.5253 10.1197 17.5941 4.3600 9.5618 26.6815 32.0392 146.3042 15.9020 6.7750 21.8154 7.0119 14.0882 6.2786 6.8025 5.7002 8.4289 39.3574 44.6241 0.4774 31.5815 72.8160 191.0844 30.6424 18.0082 12.2617 37.2346 38.7383 25.8957 46.4209 39.6326 50.1265 45.7992 24.0294 33.0668 34.9668 7.9775 13.8992 7.4910 8.2904 9.5260 2.1144
temp: 298.150 k
press: 1.00000 atm
elementType: 17 17 8 7 6 6 6 6 6 6 6 6 6 6 6 6 6 6 6 6 6 6 6 1 1 1 1 1 1 1 1 1 1 1 1 1 1 1 1 1 1 1 1 1
symmnumber: 1
zpe: 926792.3 jmol-1
zpe.correction: 0.352997 hartree
zpe.thermalcorrener: 0.375268 hartree
zpe.thermalcorrenthalpy: 0.376213 hartree
zpe.thermalcorrgfe: 0.298793 hartree
zpe.sumelectzpe: -1785.002447 hartree
zpe.sumelectthermal: -1784.980175 hartree
zpe.sumelectthermalent: -1784.979231 hartree
zpe.sumelectthermalfe: -1785.056650 hartree
dipole: -1.6278 -1.5028 0.1333
dipole: 2.2194
quadrupole: -150.8529 -139.9867 -152.7787
quadrupole: 23.6702 -0.4598 -1.7628
quadrupole: -2.9801 7.8861 -4.9060 23.6702 -0.4598 -1.7628
hfenergy: -1785.3554432 hartree
pointgroup: C01 [X(C19H21Cl2N1O1)]
dipole: 0.6651243 -0.5585316 -0.090126 debye
polarizability: 319.2127635|3.5930895|251.3832306|-0.0677781|13.3693927|132.1124898 unknown
InChI: InChI=1S/C19H21Cl2NO/c1-22(2)17-8-4-7-15-18(10-9-16(21)19(15)17)23-12-13-5-3-6-14(20)11-13/h3,5-6,9-11,17H,4,7-8,12H2,1-2H3
charge 0 multiplicity 1
44 atoms
Cl -4.643533 -1.998895 0.278219
Cl 5.209688 2.882776 0.06273
O  1.186619 -0.49827 0.080448
N  -4.37288 1.040027 -0.692638
C  -3.553767 0.940812 0.55126
C  -2.977381 2.317164 1.026817
C  -1.605744 2.201214 1.717666
C  -2.494078 -0.154715 0.362409
C  -0.604899 1.519668 0.761634
C  -1.102311 0.136119 0.36898
C  -0.166275 -0.898229 0.079138
C  -2.886498 -1.502262 0.148508
C  -5.689458 1.662822 -0.50124
C  -3.67074 1.48557 -1.904057
C  -0.587545 -2.220559 -0.178725
C  -1.965592 -2.524193 -0.124029
C  2.198093 -1.521186 -0.183681
C  3.573654 -0.878013 -0.138224
C  3.724311 0.525997 -0.060799
C  4.723986 -1.704938 -0.19139
C  5.022699 1.068148 -0.040224
C  6.014324 -1.133844 -0.172296
C  6.179444 0.269239 -0.095284
H  -4.255651 0.569892 1.325949
H  -3.710871 2.808293 1.692746
H  -2.858547 2.977424 0.144791
H  -1.688808 1.605705 2.648499
H  -1.23823 3.205448 2.003196
H  0.391014 1.423754 1.227931
H  -0.46641 2.153884 -0.139168
H  -6.301177 1.512913 -1.410299
H  -5.654845 2.762976 -0.29788
H  -6.210705 1.172988 0.341622
H  -2.732641 0.91622 -2.025562
H  -3.417962 2.576642 -1.923887
H  -4.306709 1.279895 -2.784977
H  0.123268 -3.02047 -0.400988
H  -2.313675 -3.547652 -0.28771
H  2.019179 -1.971412 -1.183953
H  2.125893 -2.32973 0.574172
H  2.840358 1.16489 -0.01597
H  4.614167 -2.794971 -0.246096
H  6.899708 -1.776995 -0.213193
H  7.17463 0.722255 -0.076744
