program: Gaussian 09
title: 000045927
version: EM64L-G09RevD.01
frameworkgroup: C1[X(C18H24N2S)]
method: RPBEPBE
basis: SDD
operation: Freq
keyword: #p
keyword: freq=noraman
keyword: PBEPBE/SDD
title: #p freq=noraman PBEPBE/SDD
converged: YES YES NO NO
title: Mulliken charges:
elementType: S N N C C C C C C C C C C C C C C C C C C H H H H H H H H H H H H H H H H H H H H H H H H
charge: 0.174989 -0.264864 -0.092404 -0.420302 -0.434603 -0.346515 0.449463 0.388749 -0.398148 -0.343397 -0.625374 -0.605553 -0.377361 -0.382948 -0.237490 -0.236756 -0.227894 -0.236819 -0.243833 -0.273645 -0.839749 0.289207 0.204371 0.224317 0.229493 0.191154 0.203702 0.270024 0.222263 0.187056 0.239484 0.222213 0.223331 0.185688 0.253097 0.234508 0.255494 0.230969 0.220435 0.218526 0.231485 0.225418 0.299399 0.262145 0.250678
chargesum: 0.00000
title: Mulliken charges with hydrogens summed into heavy atoms:
elementType: S N N C C C C C C C C C C C C C C C C C C
charge: 0.174989 -0.264864 -0.092404 0.073276 0.019206 0.048341 0.449463 0.388749 -0.398148 -0.073373 0.023429 0.025678 -0.124264 -0.148440 0.018003 -0.005787 -0.007459 -0.018293 -0.012348 -0.048227 -0.027526
polarizability: 2.36550075e+02 3.31625797e+01 2.55736904e+02 8.92095832e+00 -1.74007074e+01 1.94740918e+02
1716.lowfreq: -9.3954 -3.5541 -0.0010 -0.0008 0.0015 5.9874 16.7158 25.6402 39.3944
frequency: 16.4378 25.1331 39.0988 47.9990 50.4615 61.4696 68.1123 91.2537 102.9925 110.0535 147.0298 170.2215 185.9750 209.5192 222.6083 243.3346 265.8817 279.2424 287.4554 304.4248 334.2926 355.7022 364.3327 384.7539 410.7167 414.9776 453.1837 469.0225 489.4677 530.7993 541.7333 591.9619 611.9579 619.6670 643.5990 660.8546 695.0560 725.5468 738.8075 747.3599 752.1871 770.8215 801.4018 823.8900 858.8305 872.4965 882.3352 884.5854 955.0263 956.3339 960.4124 966.6623 977.3918 977.6176 985.8499 990.4732 1024.0443 1025.0784 1034.1633 1038.7359 1052.7078 1067.7678 1076.2594 1081.5437 1094.8297 1101.6475 1120.0371 1136.8012 1163.0863 1169.6824 1170.9628 1196.9237 1219.3945 1236.8938 1254.7105 1264.4734 1268.4893 1285.8285 1315.5137 1325.2769 1330.9069 1344.9765 1360.1354 1363.1777 1370.8540 1381.3990 1416.9302 1418.5397 1439.8874 1440.2040 1448.1529 1458.1582 1459.5651 1462.9790 1467.7021 1474.6098 1476.7212 1482.7363 1486.1861 1488.0429 1494.5692 1564.0926 1577.8869 1587.2185 1616.5929 2824.9680 2843.2512 2859.1252 2992.8717 3001.4485 3005.2874 3017.2197 3017.3616 3028.4694 3045.7360 3076.0296 3084.1719 3089.0849 3121.5383 3128.1216 3128.7910 3135.5612 3140.0133 3150.9712 3151.8741 3153.6829 3159.8623 3166.7372 3170.5006
redmass: 4.1073 4.8277 2.7402 4.3107 2.9774 3.6146 4.0759 2.9416 3.7231 1.5182 2.2600 5.4251 3.3450 1.8305 2.1507 1.2272 2.5577 2.4990 4.4098 2.0293 2.6546 2.2752 4.6422 5.8810 2.1939 2.9621 3.5708 4.0405 3.4515 3.7054 3.8593 4.7955 5.1868 4.8020 6.9481 5.5591 1.9374 5.1087 1.9342 2.3847 1.8104 1.5937 1.9358 1.2508 2.1918 1.4904 1.4350 2.2093 1.3717 1.1901 1.3758 2.1423 2.1106 2.0800 1.3246 1.2730 2.8667 5.0728 1.5721 2.3928 2.3870 2.4394 1.7143 1.9566 1.5908 1.7325 1.6865 1.4707 1.5443 1.0685 1.0550 1.1213 1.7858 1.9840 1.8777 1.7962 1.7057 1.4710 1.2565 1.6200 1.1439 2.3043 1.5394 3.2946 1.3615 5.7928 1.1464 2.1415 1.0670 1.1675 2.4395 1.7195 1.2998 1.0635 1.0891 1.0545 1.0970 1.1230 1.1861 1.5503 1.2020 6.3596 6.1990 6.2049 6.1044 1.0703 1.0572 1.0576 1.0652 1.0812 1.0682 1.0683 1.0316 1.0721 1.0985 1.1011 1.1005 1.0980 1.0846 1.0884 1.0856 1.1044 1.0894 1.0939 1.0935 1.1046 1.0947 1.1008 1.0986
irintensity: 0.0293 0.6348 0.6964 0.2469 0.9514 1.2987 0.4491 0.6573 0.3006 0.1702 1.8568 1.1391 1.6810 0.4902 1.0887 0.6149 2.9685 1.1306 0.3674 5.8967 3.9194 4.1440 1.7085 1.2018 0.8951 0.4035 2.4601 11.2937 19.7102 1.7379 4.9959 2.9518 2.2701 6.0524 0.3704 3.3419 31.0751 4.9008 9.4278 26.9998 100.5719 28.7261 11.5208 0.7902 4.1158 2.3953 2.2228 7.2942 0.8182 14.6792 2.9451 23.3583 2.7357 2.5262 0.1000 12.5518 3.2539 13.6393 20.0244 10.1618 7.4629 7.1311 11.8145 26.7991 16.6432 8.9248 4.9066 7.1779 21.9942 0.4341 0.2850 7.8041 58.5715 8.8555 39.9494 16.8629 11.5870 7.3227 7.0696 20.4136 0.2052 30.9168 9.4498 53.3474 1.6193 12.7690 1.7532 19.3829 14.0101 3.7321 6.2439 39.3951 51.0802 11.6650 17.7326 12.5675 15.0063 10.0838 13.8148 155.5980 52.2433 13.3061 6.8268 37.5467 155.3753 67.8726 72.9965 275.3737 10.4231 9.2166 41.9537 29.1960 41.1850 28.6799 32.5755 27.7906 47.3047 13.7765 8.9561 9.1979 4.6372 8.7750 8.2105 37.8971 8.0966 3.3395 37.2122 26.3502 7.4477
temp: 298.150 k
press: 1.00000 atm
elementType: 16 7 7 6 6 6 6 6 6 6 6 6 6 6 6 6 6 6 6 6 6 1 1 1 1 1 1 1 1 1 1 1 1 1 1 1 1 1 1 1 1 1 1 1 1
symmnumber: 1
zpe: 991456.4 jmol-1
zpe.correction: 0.377626 hartree
zpe.thermalcorrener: 0.399607 hartree
zpe.thermalcorrenthalpy: 0.400551 hartree
zpe.thermalcorrgfe: 0.324141 hartree
zpe.sumelectzpe: -1206.275239 hartree
zpe.sumelectthermal: -1206.253258 hartree
zpe.sumelectthermalent: -1206.252314 hartree
zpe.sumelectthermalfe: -1206.328724 hartree
dipole: 0.9239 -0.2764 -1.1728
dipole: 1.5184
quadrupole: -129.1189 -125.8703 -132.2650
quadrupole: -5.1679 -2.3787 -5.0904
quadrupole: -0.0342 3.2145 -3.1803 -5.1679 -2.3787 -5.0904
hfenergy: -1206.6528649 hartree
pointgroup: C01 [X(C18H24N2S1)]
dipole: 0.4510783 -0.1009301 0.3784141 debye
polarizability: 206.4337436|-10.612914|280.0135691|-19.0517741|-4.4333144|200.5805848 unknown
InChI: InChI=1S/C18H24N2S/c1-19(2)14-9-15-20(16-10-5-4-6-11-16)17-12-7-8-13-18(17)21-3/h4-8,10-13H,9,14-15H2,1-3H3
charge 0 multiplicity 1
45 atoms
S  -1.018836 -1.933156 -2.12454
N  -0.285611 0.36876 -0.003031
N  3.849731 -0.835238 -0.895853
C  1.077881 0.336912 -0.590572
C  2.199658 0.523199 0.460785
C  3.606385 0.434404 -0.168315
C  -0.766641 -0.872914 0.546048
C  -0.923394 1.597149 0.29606
C  -1.090489 -1.989498 -0.282828
C  -0.872814 -1.019946 1.956621
C  3.859514 -2.020241 -0.014235
C  5.063544 -0.765994 -1.73371
C  -2.267582 1.620571 0.784407
C  -0.28041 2.851206 0.060432
C  -1.457047 -3.222919 0.311038
C  -1.255713 -2.244556 2.539395
C  -2.925444 2.840647 1.031698
C  -0.956821 4.065166 0.304302
C  -1.534615 -3.35936 1.713855
C  -2.280911 4.078801 0.796555
C  -2.232198 -0.528644 -2.490954
H  1.217047 -0.629553 -1.100752
H  1.156019 1.109703 -1.378609
H  2.079922 -0.238627 1.254514
H  2.104594 1.507765 0.958198
H  4.373373 0.60124 0.634568
H  3.726368 1.259599 -0.898699
H  -0.635857 -0.155749 2.587015
H  4.02645 -2.927048 -0.622164
H  4.658076 -1.975404 0.7709
H  2.886495 -2.134147 0.493407
H  5.162509 -1.695799 -2.322183
H  4.981312 0.078426 -2.441454
H  6.006163 -0.63098 -1.142605
H  -2.796587 0.678455 0.958503
H  0.746921 2.887049 -0.311919
H  -1.70534 -4.065839 -0.342248
H  -1.321192 -2.332357 3.629488
H  -3.956824 2.821693 1.403206
H  -0.435181 5.010236 0.111638
H  -1.825238 -4.319239 2.154138
H  -2.797761 5.024606 0.988838
H  -1.887026 0.398997 -2.015059
H  -3.234973 -0.803096 -2.130995
H  -2.238459 -0.41838 -3.586781
