program: Gaussian 09
title: 000045838
version: EM64L-G09RevD.01
frameworkgroup: C1[X(C18H24N2O2)]
method: RPBEPBE
basis: SDD
operation: Freq
keyword: #p
keyword: freq=noraman
keyword: PBEPBE/SDD
title: #p freq=noraman PBEPBE/SDD
converged: YES YES NO NO
title: Mulliken charges:
elementType: O O N N C C C C C C C C C C C C C C C C C C H H H H H H H H H H H H H H H H H H H H H H H H
charge: -0.291435 -0.223459 -0.145272 -0.085509 -0.154975 -0.146175 -0.439408 -0.442943 -0.377623 -0.390730 -0.345635 0.205745 -0.538982 -0.472824 -0.674347 0.116093 0.280863 -0.339311 -0.344721 -0.248772 -0.230789 -0.223000 0.282153 0.241336 0.209342 0.228867 0.226374 0.216806 0.213148 0.215365 0.193555 0.226468 0.236263 0.198616 0.248901 0.243637 0.222017 0.221266 0.202120 0.228289 0.234194 0.246015 0.278215 0.231436 0.234380 0.234448
chargesum: 0.00000
title: Mulliken charges with hydrogens summed into heavy atoms:
elementType: O O N N C C C C C C C C C C C C C C C C C C
charge: -0.291435 -0.223459 -0.145272 -0.085509 0.127178 0.095161 -0.001200 0.000238 0.050890 0.029293 0.089244 0.205745 -0.046443 -0.029541 -0.009744 0.116093 0.280863 -0.093297 -0.066506 -0.017336 0.003591 0.011448
polarizability: 2.81018585e+02 -1.56629481e+01 1.94481885e+02 5.91604728e-01 -1.33203867e+01 1.53727375e+02
1716.lowfreq: -8.4709 -3.7548 -0.0006 -0.0004 0.0003 4.3773 16.5071 20.6751 28.8393
frequency: 16.4567 17.8364 28.6991 42.9134 44.9374 55.7705 88.5024 97.0197 124.1946 150.9636 157.7777 171.2001 178.7451 192.9428 201.1777 267.7469 289.2247 298.2217 328.5636 344.6013 376.6604 399.6846 411.3865 416.7180 475.7734 479.8237 496.1875 510.3717 549.6918 573.1443 603.1883 613.6039 648.7147 689.9855 696.9026 746.3156 752.7121 757.3743 786.5047 799.2647 804.6063 821.9239 842.4028 856.6567 859.4699 905.5377 921.6027 932.3461 943.6681 970.1712 988.9426 990.3114 991.3083 998.7638 1010.5959 1015.4240 1023.2570 1028.5723 1041.1018 1045.1601 1074.6213 1080.4996 1084.2959 1088.8005 1090.0398 1120.7952 1138.2335 1152.8121 1165.6740 1173.5114 1186.8662 1194.9518 1197.5414 1205.7253 1220.0590 1240.1086 1253.9603 1259.3446 1265.2699 1278.1590 1289.2387 1295.1238 1299.4981 1310.5344 1317.7659 1321.4570 1330.3249 1336.5483 1360.5862 1387.8150 1391.3790 1392.2212 1413.8061 1433.9075 1437.2130 1448.6380 1451.7689 1460.5612 1464.3094 1464.7557 1469.8601 1475.8692 1478.4376 1479.2217 1569.1354 1582.5666 1598.4038 1612.3641 2849.4997 2872.2884 2880.3807 2966.9961 2971.9769 2997.2632 3012.8985 3016.8462 3019.8098 3022.2927 3027.2461 3031.1693 3049.4714 3073.3005 3078.9059 3090.0735 3092.8430 3098.8847 3106.8347 3129.3351 3139.2359 3150.5859 3159.5189 3169.9390
redmass: 4.3368 5.0256 4.1026 5.3194 2.6093 4.5944 2.4148 2.7802 3.1686 3.1645 3.7726 2.2348 1.8242 1.8295 3.4523 3.3321 3.2429 5.0434 2.5455 2.2874 4.4812 2.8085 4.2364 3.2124 3.4876 4.1587 3.9653 3.7798 3.1725 2.3483 3.5663 6.3292 5.4070 3.3751 1.8232 4.5886 3.7808 1.6762 2.0423 1.7646 1.3438 2.3916 2.8357 2.3531 1.3011 2.8070 3.0280 1.7543 1.3954 3.4805 3.0922 4.4608 1.3951 2.0202 1.3510 1.6416 2.2856 2.1062 1.8930 1.8766 1.5825 2.0321 1.9827 2.0225 2.5951 2.0250 2.1887 1.9458 1.3016 1.0711 1.1379 1.4736 1.3736 1.5409 2.1120 1.3885 1.1870 1.4533 1.3915 1.3500 1.6792 1.3952 1.5334 1.5466 1.4615 1.5760 1.6582 1.3633 1.4260 9.1629 1.2874 1.3819 3.8691 1.3166 1.7053 1.1096 1.0832 1.0876 1.0822 1.0424 1.0997 1.1701 1.0733 1.9023 6.8252 8.2423 6.8090 6.4659 1.0704 1.0713 1.0697 1.0597 1.0600 1.0367 1.0603 1.0993 1.0885 1.0947 1.0643 1.0876 1.0910 1.0963 1.0939 1.0896 1.0996 1.1041 1.1001 1.0851 1.0879 1.0922 1.0960 1.1013
irintensity: 0.7930 1.4415 0.0839 2.8001 0.0655 1.4700 2.8934 2.5465 1.8637 2.6702 0.2807 0.7855 0.3344 0.6690 6.8045 5.1867 2.6986 12.5366 2.4534 6.8409 6.1875 0.0770 0.7293 1.1648 2.3193 5.3140 7.2838 5.0879 3.6960 4.7426 2.6877 0.3639 15.1610 0.5487 47.4853 4.0266 4.4753 52.4010 3.8123 7.1956 15.5784 14.4407 16.9999 9.2643 1.9578 1.5999 9.3103 1.5733 2.7178 57.1819 11.4484 17.0515 1.0926 8.4516 1.0231 9.7314 11.6478 19.7484 3.5620 1.1050 0.5721 4.4929 9.5604 7.4079 7.2437 16.6556 45.6397 4.5051 12.7696 3.1027 26.3367 8.7464 10.0429 61.6064 27.7574 50.2610 0.3881 19.2620 2.7253 33.3688 37.7626 10.6182 59.3500 26.1166 0.5849 72.8961 9.6654 21.6675 21.2600 2.8982 8.6894 31.2782 221.8100 9.7225 27.1396 29.7558 3.2466 1.5082 5.5506 12.8176 12.9287 11.4590 16.8082 3.0294 96.5521 311.4363 41.6432 10.3939 74.9774 23.7577 136.4399 31.7618 24.8923 37.9172 21.1400 15.0325 33.1528 9.3380 49.7590 45.1231 24.0727 21.8069 11.8834 11.2493 32.1056 57.1217 31.6444 0.2067 5.9453 17.2965 23.3957 21.0929
temp: 298.150 k
press: 1.00000 atm
elementType: 8 8 7 7 6 6 6 6 6 6 6 6 6 6 6 6 6 6 6 6 6 6 1 1 1 1 1 1 1 1 1 1 1 1 1 1 1 1 1 1 1 1 1 1 1 1
symmnumber: 1
zpe: 1018174.6 jmol-1
zpe.correction: 0.387802 hartree
zpe.thermalcorrener: 0.408867 hartree
zpe.thermalcorrenthalpy: 0.409812 hartree
zpe.thermalcorrgfe: 0.334381 hartree
zpe.sumelectzpe: -958.609569 hartree
zpe.sumelectthermal: -958.588503 hartree
zpe.sumelectthermalent: -958.587559 hartree
zpe.sumelectthermalfe: -958.662990 hartree
dipole: -2.7118 1.7075 2.5258
dipole: 4.0803
quadrupole: -122.5354 -131.1415 -139.6391
quadrupole: -15.2417 21.7876 0.8466
quadrupole: 8.5699 -0.0361 -8.5338 -15.2417 21.7876 0.8466
hfenergy: -958.997371 hartree
pointgroup: C01 [X(C18H24N2O2)]
dipole: 1.0190623 -1.0430999 0.6711916 debye
polarizability: 280.1801834|-18.0136654|179.5758481|-3.5529595|23.765822|169.4718139 unknown
InChI: InChI=1S/C18H24N2O2/c1-2-18(22)20-15-8-9-16(20)13-19(12-15)11-10-17(21)14-6-4-3-5-7-14/h3-7,15-16H,2,8-13H2,1H3
charge 0 multiplicity 1
46 atoms
O  -4.680951 0.464586 -2.106971
O  2.886215 1.724199 1.445297
N  -3.629827 -0.339888 -0.206869
N  -0.86865 -0.047228 0.57448
C  -2.568528 -1.095271 -0.917679
C  -3.245113 -0.431427 1.223387
C  -2.45998 -2.390116 -0.060297
C  -2.906987 -1.946544 1.375583
C  -1.2710 -0.248729 -0.845044
C  -1.985382 0.454513 1.418587
C  0.355623 0.770159 0.742166
C  -4.59789 0.420465 -0.837066
C  1.609183 0.063113 0.198081
C  -5.567899 1.185133 0.081743
C  -6.673728 1.903227 -0.712031
C  2.908476 0.735157 0.653172
C  4.217319 0.191484 0.14839
C  4.297092 -0.944002 -0.702828
C  5.41696 0.842398 0.547359
C  5.550826 -1.416412 -1.146203
C  6.667861 0.37163 0.103561
C  6.738013 -0.759809 -0.745588
H  -2.865033 -1.2570 -1.965338
H  -4.053962 -0.094796 1.890715
H  -1.428656 -2.780266 -0.060433
H  -3.131941 -3.167503 -0.46333
H  -3.801303 -2.504659 1.703689
H  -2.104746 -2.097616 2.116719
H  -0.458329 -0.778076 -1.375199
H  -1.451651 0.719963 -1.374254
H  -2.25956 1.513476 1.175355
H  -1.659817 0.426131 2.475864
H  0.501922 0.956356 1.821253
H  0.258567 1.775932 0.262914
H  1.60491 -0.989588 0.549099
H  1.601777 0.01981 -0.908657
H  -6.015252 0.478896 0.810029
H  -4.990441 1.919734 0.680001
H  -7.332427 2.4717 -0.030532
H  -7.286211 1.179359 -1.275603
H  -6.23621 2.597574 -1.448476
H  3.386841 -1.464211 -1.018751
H  5.334419 1.713729 1.205646
H  5.604741 -2.29264 -1.801411
H  7.586726 0.880258 0.414885
H  7.710603 -1.126897 -1.092115
