program: Gaussian 09
title: 000045903
version: EM64L-G09RevD.01
frameworkgroup: C1[X(C21H22N2O)]
method: RPBEPBE
basis: SDD
operation: Freq
keyword: #p
keyword: freq=noraman
keyword: PBEPBE/SDD
title: #p freq=noraman PBEPBE/SDD
converged: YES YES NO NO
title: Mulliken charges:
elementType: O N N C C C C C C C C C C C C C C C C C C C C C H H H H H H H H H H H H H H H H H H H H H H
charge: -0.267104 -0.263851 -0.304923 0.287306 0.223562 -0.106652 0.247731 -0.360991 0.178814 0.352387 -0.426704 0.153285 -0.367957 -0.404462 -0.322450 -0.396524 -0.679701 -0.405867 -0.260816 -0.820150 -0.240627 -0.246789 -0.229942 -0.533130 0.250803 0.208184 0.246940 0.256412 0.240395 0.246677 0.272746 0.230838 0.241973 0.215304 0.233827 0.226353 0.224486 0.229801 0.264562 0.227839 0.230822 0.228604 0.228218 0.244191 0.221235 0.225345
chargesum: 0.00000
title: Mulliken charges with hydrogens summed into heavy atoms:
elementType: O N N C C C C C C C C C C C C C C C C C C C C C
charge: -0.267104 -0.263851 -0.076705 0.287306 0.223562 -0.106652 0.247731 0.097997 0.178814 0.352387 -0.179764 0.153285 -0.111546 -0.164067 -0.075772 -0.123778 0.008414 -0.172040 -0.034463 -0.101301 -0.012788 -0.015967 -0.001338 0.157640
polarizability: 3.33028596e+02 4.54761403e+00 2.70116989e+02 -1.90461042e+01 -4.60517226e+00 1.46565103e+02
1716.lowfreq: -6.5238 -2.8085 -0.0007 -0.0006 -0.0004 3.4173 16.8382 23.4453 42.2995
frequency: 16.3507 22.4749 42.2300 56.3440 72.2968 84.7934 102.8572 110.0699 122.9387 127.9177 146.4824 162.2584 176.4240 197.5858 211.5849 219.2233 242.4831 260.5532 279.9410 304.9226 332.7649 340.0653 369.6731 400.6738 428.2096 450.3949 460.0010 470.1920 477.1300 494.4878 516.2744 541.0541 563.5595 571.3396 600.1451 633.9648 652.1652 668.7166 692.7508 706.1748 722.2000 738.5936 768.3859 780.6653 786.1053 787.8771 801.0403 813.0124 825.6815 844.7034 876.1011 887.4380 921.8398 931.1269 943.6026 955.9890 971.8949 986.8527 989.5815 991.3012 995.2089 1025.0191 1040.5668 1045.7304 1050.0637 1072.6221 1086.3067 1091.8513 1114.0165 1127.5703 1139.9166 1152.7975 1168.6500 1172.3487 1175.0666 1180.3505 1199.0865 1214.5794 1238.0530 1251.3160 1267.6175 1278.3157 1291.4304 1353.7869 1356.5656 1360.5858 1366.8352 1384.6296 1390.2680 1401.8433 1420.0977 1431.9257 1432.4677 1439.3541 1458.8983 1464.2564 1467.4796 1468.0958 1468.7168 1475.0821 1475.8120 1483.8028 1486.1594 1516.7056 1572.8902 1583.7361 1584.8361 1601.4091 1610.4410 1628.0549 2951.9921 2961.9842 2977.5984 2986.0828 3050.7770 3054.9680 3067.0324 3082.2632 3088.0556 3099.1610 3121.4430 3125.9646 3126.3171 3133.7175 3142.5750 3143.2800 3147.3310 3157.8281 3164.6894 3169.5701 3174.8094 3303.0701
redmass: 4.2021 4.2042 4.8499 4.0171 2.6888 3.9430 3.2536 1.3979 2.3430 3.7218 3.6997 3.7159 3.1927 3.2712 1.5211 3.6231 1.3608 1.8233 3.3759 4.3942 3.0524 3.4692 3.0226 4.3490 3.3774 4.8699 3.0768 3.9867 4.5169 5.1389 4.4413 4.0833 5.3515 4.8127 4.5208 3.1016 4.2501 4.5205 4.7765 5.1785 3.8329 2.1143 1.3600 1.4743 2.8606 2.0162 3.4213 2.6057 1.5995 1.2693 1.3045 1.6353 3.2639 1.4396 2.4015 1.6713 1.3709 1.6511 3.5269 1.3726 1.3173 2.6573 2.1502 1.8235 1.8012 3.7373 1.9971 2.0861 1.2605 1.6802 1.5445 1.5382 1.5062 1.0704 1.1874 2.2316 2.3448 1.8006 2.2778 2.4231 1.7125 1.4831 1.5809 1.3598 2.9550 2.9626 4.6193 1.2201 2.5211 1.2474 7.3355 1.8292 2.0280 1.6607 2.1265 1.1242 1.0508 1.0995 1.0483 1.4782 1.1302 1.5527 1.0912 4.0479 6.9306 6.4791 6.4017 6.8154 6.3952 6.8461 1.0695 1.0328 1.0375 1.0356 1.1039 1.0970 1.0937 1.0963 1.0990 1.1009 1.0866 1.0993 1.0857 1.0886 1.0898 1.0889 1.0943 1.0964 1.1008 1.0943 1.0972 1.0739
irintensity: 0.4268 0.0679 0.8841 1.4438 1.1408 0.7979 3.3119 0.1063 0.8781 3.0861 1.9066 0.0954 1.5822 4.2063 0.7969 2.0257 0.3408 0.1608 2.5833 7.1344 1.8719 0.7730 1.2150 0.2167 5.8639 0.5198 10.7205 2.8214 5.6173 6.1453 8.5511 4.2458 1.1961 1.7714 18.3729 4.3994 0.3557 0.9069 18.7532 0.6532 8.6144 10.7511 51.0740 84.5309 16.9504 6.2252 0.3431 13.8292 38.2616 54.4925 0.0555 1.4076 3.3819 2.0115 3.7944 1.3510 1.5975 2.4989 5.7581 0.4023 0.3979 21.6120 9.2122 29.7777 23.8296 116.2234 8.3831 44.1318 0.1231 46.7295 7.4910 4.6825 27.9577 3.5162 2.9197 7.8000 9.9110 30.7122 153.4321 13.3890 81.7149 0.7147 83.8487 12.5403 54.0584 81.7756 44.3887 27.1280 44.0875 15.6893 8.7923 14.3128 3.2554 16.8299 42.0732 5.5461 16.0717 23.5673 0.7822 26.2706 23.1228 31.6003 14.6945 31.9596 89.4266 24.9213 70.2383 27.7131 4.9861 2.0553 52.5774 78.3950 21.2342 27.1828 44.1412 12.4465 1.0804 34.6334 25.9574 39.8380 6.8966 21.3586 6.3960 5.9421 13.0006 11.0103 35.0378 23.4535 22.4832 16.7858 14.9175 32.6679
temp: 298.150 k
press: 1.00000 atm
elementType: 8 7 7 6 6 6 6 6 6 6 6 6 6 6 6 6 6 6 6 6 6 6 6 6 1 1 1 1 1 1 1 1 1 1 1 1 1 1 1 1 1 1 1 1 1 1
symmnumber: 1
zpe: 986603.3 jmol-1
zpe.correction: 0.375777 hartree
zpe.thermalcorrener: 0.398217 hartree
zpe.thermalcorrenthalpy: 0.399161 hartree
zpe.thermalcorrgfe: 0.322944 hartree
zpe.sumelectzpe: -996.432157 hartree
zpe.sumelectthermal: -996.409718 hartree
zpe.sumelectthermalent: -996.408774 hartree
zpe.sumelectthermalfe: -996.484991 hartree
dipole: 0.4891 -0.9815 3.4082
dipole: 3.5803
quadrupole: -114.4391 -124.3117 -153.2657
quadrupole: 9.1878 -2.5957 -5.9520
quadrupole: 16.2330 6.3605 -22.5935 9.1878 -2.5957 -5.9520
hfenergy: -996.8079344 hartree
pointgroup: C01 [X(C21H22N2O1)]
dipole: 0.1781915 -0.5817462 1.2703993 debye
polarizability: 333.339318|8.9862564|269.0956727|-13.905924|14.0691172|147.2756981 unknown
InChI: InChI=1S/C21H22N2O/c1-4-23(19-12-8-5-9-15(19)2)21(22)18-13-14-20(24-3)17-11-7-6-10-16(17)18/h5-14,22H,4H2,1-3H3
charge 0 multiplicity 1
46 atoms
O  -5.013076 -0.982788 -0.036629
N  1.460255 -0.017485 0.279623
N  1.106381 -0.588194 -2.064664
C  -0.81846 -0.511874 -0.610878
C  -1.66343 0.632008 -0.354108
C  0.66456 -0.371432 -0.84084
C  2.894272 0.110481 0.091763
C  0.981105 -0.079074 1.687646
C  -3.085619 0.441582 -0.160466
C  3.724439 -1.050958 0.077312
C  -1.400056 -1.777559 -0.713152
C  -3.628708 -0.893902 -0.243632
C  -1.150188 1.971701 -0.319941
C  -2.799418 -1.985124 -0.527357
C  3.458985 1.398564 -0.061528
C  -3.927311 1.573665 0.083405
C  1.145571 1.239776 2.469345
C  5.121416 -0.869828 -0.082972
C  -1.991742 3.062825 -0.091348
C  3.130441 -2.44174 0.205226
C  -3.390837 2.863339 0.121469
C  4.853249 1.558474 -0.22111
C  5.686572 0.417601 -0.228361
C  -5.629609 -2.30655 -0.142356
H  -0.081011 -0.372134 1.666257
H  1.530704 -0.88502 2.219342
H  -0.761202 -2.633067 -0.955541
H  -0.081406 2.12605 -0.500946
H  -3.20119 -2.99825 -0.614774
H  2.791499 2.266974 -0.061742
H  -4.997795 1.403857 0.227514
H  2.203725 1.552228 2.515637
H  0.556091 2.048847 2.005491
H  0.786188 1.103234 3.506342
H  5.771862 -1.752661 -0.098385
H  -1.58154 4.078944 -0.082119
H  3.918481 -3.212495 0.164407
H  2.580898 -2.567404 1.156672
H  2.409426 -2.641312 -0.609135
H  -4.042554 3.725015 0.303168
H  5.281724 2.559429 -0.340565
H  6.769833 0.527734 -0.351113
H  2.141179 -0.486342 -2.146199
H  -6.70012 -2.141766 0.048562
H  -5.217036 -3.002773 0.613478
H  -5.490548 -2.732695 -1.154699
