program: Gaussian 09
title: 000045692
version: EM64L-G09RevD.01
frameworkgroup: C1[X(C9H13NO2)]
method: RPBEPBE
basis: SDD
operation: Freq
keyword: #p
keyword: freq=noraman
keyword: PBEPBE/SDD
title: #p freq=noraman PBEPBE/SDD
converged: YES YES NO NO
title: Mulliken charges:
elementType: O O N C C C C C C C C C H H H H H H H H H H H H H
charge: -0.309500 -0.263625 -0.627915 0.137191 0.393159 -0.715254 -0.697331 -0.697432 -0.395856 0.212325 -0.344015 0.113507 0.219497 0.218673 0.218630 0.221890 0.215367 0.225589 0.215459 0.221764 0.225532 0.261279 0.279773 0.336863 0.334430
chargesum: 0.00000
title: Mulliken charges with hydrogens summed into heavy atoms:
elementType: O O N C C C C C C C C C
charge: -0.309500 -0.263625 0.043377 0.137191 0.393159 -0.058454 -0.034485 -0.034677 -0.134577 0.212325 -0.064242 0.113507
polarizability: 1.49677866e+02 -1.05895082e+00 1.14238911e+02 5.19564287e-02 1.02645550e-02 7.04659796e+01
1716.lowfreq: -4.7802 -3.3229 -0.0006 -0.0006 -0.0004 10.3769 41.5013 70.0405 109.7969
frequency: 40.8750 70.0335 109.7966 117.8532 185.9559 205.1580 211.7800 259.9849 262.4326 284.1608 323.1408 326.0181 394.7831 415.3833 432.8391 524.1935 527.3485 549.2280 579.1026 607.2242 641.6786 682.7832 729.9886 813.2349 823.1329 896.0323 908.8161 919.8979 920.9671 934.4179 947.5877 1010.7030 1021.9942 1029.1524 1052.3046 1097.4418 1140.0833 1184.4625 1204.7069 1224.3095 1275.1002 1326.3230 1355.3366 1370.4155 1373.5257 1398.4624 1455.2211 1469.3074 1469.3626 1476.6644 1480.2674 1493.0428 1542.0641 1573.8191 1598.0000 1624.3235 2978.1506 2978.6019 2983.0004 3074.9077 3077.5538 3078.4620 3084.3226 3087.3055 3091.2410 3228.9100 3247.4696 3524.1106 3683.2647
redmass: 3.2364 5.4639 4.0781 4.3261 3.3047 1.0979 2.9997 1.1195 1.0450 3.3278 2.5911 2.5430 3.7229 3.1370 3.2748 3.7701 1.4359 1.1590 3.7760 2.5175 3.7219 4.8526 6.1705 2.8675 1.2990 1.4020 5.7841 6.4812 1.7473 1.6653 1.2052 1.3737 1.3889 1.3346 1.9676 4.0169 3.9267 1.5762 2.9299 2.8031 3.3544 3.5393 4.6679 1.1848 1.1997 1.2104 1.0494 1.0480 1.0477 1.0558 1.0499 1.1438 5.2077 1.9442 5.3942 2.5674 1.0346 1.0345 1.0355 1.1008 1.1003 1.1005 1.0991 1.1004 1.0997 1.0940 1.1035 1.0443 1.1050
irintensity: 1.2603 5.4088 3.0225 7.5771 0.3636 0.1611 8.4006 0.2820 0.0008 1.5623 0.4147 2.8864 1.4582 0.0010 3.0660 1.3628 151.4698 107.0710 2.5795 33.7483 14.9582 0.0238 33.2500 5.4385 51.1707 2.4700 2.9155 19.6666 2.3576 3.6716 0.0224 19.8971 0.0850 11.6931 1.2888 25.7754 12.7368 5.3718 7.8411 8.0109 74.2663 35.5487 151.2372 18.3202 19.8230 3.7463 0.3829 0.8807 0.4428 12.3809 15.0933 2.5739 103.3677 105.0289 131.1555 273.4918 27.0778 30.2035 25.9439 1.3755 4.6682 32.3531 85.0422 17.9552 48.5825 2.9764 0.9347 40.3427 44.6808
temp: 298.150 k
press: 1.00000 atm
elementType: 8 8 7 6 6 6 6 6 6 6 6 6 1 1 1 1 1 1 1 1 1 1 1 1 1
symmnumber: 1
zpe: 538376.5 jmol-1
zpe.correction: 0.205057 hartree
zpe.thermalcorrener: 0.217749 hartree
zpe.thermalcorrenthalpy: 0.218693 hartree
zpe.thermalcorrgfe: 0.166401 hartree
zpe.sumelectzpe: -555.046819 hartree
zpe.sumelectthermal: -555.034127 hartree
zpe.sumelectthermalent: -555.033183 hartree
zpe.sumelectthermalfe: -555.085475 hartree
dipole: -4.4385 -1.9500 -0.0149
dipole: 4.8480
quadrupole: -82.5602 -62.5217 -74.3537
quadrupole: -9.5239 -0.0491 -0.0025
quadrupole: -9.4150 10.6235 -1.2085 -9.5239 -0.0491 -0.0025
hfenergy: -555.2518755 hartree
pointgroup: C01 [X(C9H13N1O2)]
dipole: 1.7635734 -0.6879426 -0.2335314 debye
dipolederiv: -0.4951588 0.0282799 -0.0183279 0.0324793 -0.5079728 -0.2283122 -0.0148577 -0.2283274 -0.257172 -1.1895729 0.19668 0.0358405 0.136929 -0.607085 -0.1247738 0.0017931 -0.1190395 -0.4411783 -0.3580549 -0.0724451 -0.0096409 -0.189527 -1.0672814 -0.2364915 -0.0782364 -0.2245856 -0.8343406 0.2193693 -0.0272827 -0.0087875 0.0494713 0.0898549 -0.0265069 0.0380038 -0.0342434 0.1253602 0.3927441 -0.1145572 -0.0245208 -0.2987244 0.2278355 0.1495506 -0.1358805 0.1675641 0.0169626 -0.0284637 -0.0362082 -0.0289691 0.0104791 0.0005856 -0.0269231 -0.0003805 -0.0316523 0.0295463 -0.0668432 0.0075874 0.0040496 0.0292857 0.0343637 -0.0149023 -0.0682841 0.0025369 -0.0453861 -0.0769707 0.0075904 -0.0061903 -0.047221 -0.0293411 0.0320217 0.046276 0.018059 0.0289094 -0.3422973 0.054044 0.0191695 0.2711498 -0.122663 0.0715364 0.1489224 0.0511686 -0.1543885 -0.4399568 -0.2334061 -0.1821102 -0.5177656 0.0488368 -0.022751 -0.3519204 0.0033828 -0.0250917 0.257012 0.004784 0.040657 0.1202829 -0.0315082 0.0739763 0.1088933 0.0626445 -0.0898771 1.6902081 0.0498119 0.1697816 0.2318947 1.2294241 0.5947154 0.2766805 0.5780672 0.6203156 -0.15573 0.0600076 0.0129892 0.1168037 0.0542944 -0.0170978 0.0473309 -0.0221793 0.0909078 0.1107846 0.0214301 -0.0169155 -0.0251085 -0.1340057 0.07289 -0.0106072 0.0928642 0.040822 0.1021236 -0.0033211 0.0606828 -0.0213767 0.0732643 -0.0217685 0.0149239 -0.0361977 -0.1589505 0.1109917 0.0080886 0.0011668 -0.0109036 -0.1109354 0.1238222 -0.0100812 0.0692027 0.0178954 -0.1584441 0.1036468 0.0635243 0.1199177 0.055243 -0.0279881 0.0620856 -0.0130439 0.0580984 0.0080803 -0.1067312 -0.0899138 -0.0964825 0.0121734 -0.0789886 -0.0610324 -0.0409184 0.0226281 -0.1526814 0.1229761 0.028532 0.1270982 0.0208125 0.0077661 0.0423327 -0.009478 0.0872448 0.10467 -0.0019787 0.0407887 -0.0131585 0.0705364 -0.0324658 0.0339561 0.0253316 -0.1574355 0.0050258 -0.1237072 -0.0598915 -0.0989629 -0.0107396 -0.027225 -0.0680235 -0.0683466 0.0486656 0.0519576 -0.0758444 -0.0569755 -0.0774829 0.087041 -0.0594284 -0.0579157 -0.0593019 0.1332855 0.0608016 0.0614651 0.0243164 0.0530987 0.1088287 -0.0424962 0.0191785 -0.0414424 0.1660374 0.1702506 0.0408454 0.0040403 0.0742427 0.2599533 -0.0616231 0.0235796 -0.0653856 0.3406398 0.1801546 0.0282445 -0.0032955 0.0235808 0.2484847 -0.0765364 -0.006737 -0.0766795 0.3365015 unknown
polarizability: 149.0402533|-1.4227598|102.9182867|6.6832499|19.0970215|82.4242159 unknown
InChI: InChI=1S/C9H13NO2/c1-9(2,3)7-5-4-6(12-7)8(10)11/h4-5H,10H2,1-3H3
charge 0 multiplicity 1
25 atoms
O  -0.218951 -0.437468 -0.247857
O  -3.791685 0.362477 -0.117778
N  -2.644995 -1.441204 -1.066457
C  2.250158 -0.301585 0.068519
C  0.872985 0.286013 0.288452
C  3.306281 0.626111 0.721838
C  2.528492 -0.416523 -1.460842
C  2.322638 -1.716677 0.717267
C  0.38505 1.425325 0.919932
C  -1.398005 0.288862 0.07244
C  -1.051581 1.427048 0.783395
C  -2.703823 -0.244196 -0.368694
H  4.316199 0.20864 0.560175
H  3.281396 1.63869 0.279462
H  3.145235 0.715308 1.811707
H  2.494523 0.575894 -1.94577
H  3.531155 -0.850915 -1.629721
H  1.781412 -1.064769 -1.951281
H  3.323476 -2.156331 0.551519
H  2.143439 -1.662185 1.806276
H  1.568653 -2.392793 0.277698
H  0.987056 2.176609 1.425959
H  -1.758027 2.165922 1.154418
H  -1.75472 -1.901253 -1.251321
H  -3.516061 -1.853601 -1.395236
