program: Gaussian 09
title: 000007015
version: EM64L-G09RevD.01
frameworkgroup: C1[X(C12H11N)]
method: RPBEPBE
basis: SDD
operation: Freq
keyword: #pfreq=noraman
keyword: PBEPBE/SDD
title: #p freq=noraman PBEPBE/SDD
converged: YES YES NO NO
title: Mulliken charges:
elementType: N C C C C C C C C C C C C H H H H H H H H H H H
charge: -0.690185 0.155761 0.217860 0.303833 -0.361296 -0.370032 -0.370019 -0.416733 -0.273119 -0.210354 -0.221753 -0.221748 -0.241588 0.238561 0.249508 0.249504 0.213166 0.223650 0.219109 0.226659 0.226657 0.228255 0.327039 0.297266
chargesum: 0.00000
title: Mulliken charges with hydrogens summed into heavy atoms:
elementType: N C C C C C C C C C C C C
charge: -0.065881 0.155761 0.217860 0.303833 -0.122735 -0.120523 -0.120515 -0.203567 -0.049469 0.008754 0.004906 0.004909 -0.013333
polarizability: 1.83478879e+02 -6.82105378e+00 1.11855005e+02 5.65527944e-03 1.03105680e-02 9.62144105e+01
1716.lowfreq: -45.3054 -8.8090 -8.0828 -0.0005 0.0004 0.0004 9.1346 81.5538 82.3361
frequency: -45.2557 81.5531 82.3286 187.8748 249.6286 284.8053 322.4536 348.2791 399.1654 413.8218 433.2885 478.2517 521.1247 558.9179 563.5205 613.4956 614.8462 707.2304 713.3658 741.9234 751.8882 768.7415 828.4237 844.3909 856.9860 923.8414 931.0423 965.0675 977.9931 985.0905 992.0182 996.1071 1010.3043 1035.5005 1044.3837 1073.6154 1131.5122 1170.0812 1171.0056 1184.9966 1256.9176 1290.5553 1306.9128 1317.4605 1364.5821 1380.9054 1426.5604 1443.6708 1475.3993 1503.6845 1580.2033 1583.5473 1606.0756 1617.6263 1631.3823 3112.7475 3121.0096 3127.0353 3127.6510 3137.8924 3140.1761 3148.5728 3162.6976 3163.3227 3557.7696 3702.2747
redmass: 3.9182 4.3842 4.1209 3.9546 4.2726 5.0891 2.2715 1.4907 2.8082 2.9880 1.0346 3.2862 4.3954 3.8244 4.1664 6.8801 6.1972 1.7276 5.4738 1.8948 1.9102 1.9596 5.0573 1.4826 1.2451 1.3992 1.3695 1.3027 1.3819 6.2773 5.6536 1.3168 1.8389 1.8288 1.9366 1.6064 1.3606 1.0525 1.0534 1.1152 2.4503 1.8736 1.3839 1.9602 6.5713 8.3664 2.1973 2.5378 2.4227 3.2286 5.9699 6.3924 5.0736 2.9682 1.5947 1.0863 1.0843 1.0879 1.0877 1.0944 1.0925 1.0968 1.1006 1.1013 1.0448 1.1040
irintensity: 0.1101 0.5355 0.7794 2.2292 1.4060 0.1884 58.6191 158.8902 0.0045 7.3006 26.9646 5.9610 5.1457 0.0769 8.0203 5.9812 0.0728 53.0158 0.1814 34.3254 61.2503 45.4033 5.8387 2.6773 0.3164 1.3212 1.9022 0.0892 0.0845 2.6394 10.1101 0.2342 12.3846 0.2417 11.4564 9.0088 14.5702 4.8101 0.0207 0.9028 5.8474 1.0913 0.2546 31.5631 0.0132 16.1668 6.7623 21.2898 55.1973 46.9710 1.5647 12.5984 1.7171 13.5629 204.3884 12.9871 1.7382 1.3274 1.0069 42.5264 15.4776 38.3043 46.0696 5.5499 54.1586 31.0347
temp: 298.150 k
press: 1.00000 atm
elementType: 7 6 6 6 6 6 6 6 6 6 6 6 6 1 1 1 1 1 1 1 1 1 1 1
symmnumber: 1
zpe: 509881.3 jmol-1
zpe.correction: 0.194204 hartree
zpe.thermalcorrener: 0.204138 hartree
zpe.thermalcorrenthalpy: 0.205082 hartree
zpe.thermalcorrgfe: 0.158872 hartree
zpe.sumelectzpe: -517.734956 hartree
zpe.sumelectthermal: -517.725021 hartree
zpe.sumelectthermalent: -517.724077 hartree
zpe.sumelectthermalfe: -517.770287 hartree
dipole: -0.9809 1.8281 -0.0002
dipole: 2.0747
quadrupole: -68.0744 -69.4906 -75.8572
quadrupole: 1.6338 0.0004 0.0033
quadrupole: 3.0663 1.6501 -4.7164 1.6338 0.0004 0.0033
hfenergy: -517.9291594 hartree
pointgroup: C01 [X(C12H11N1)]
dipole: -0.3836192 -0.7204675 -0.0002995 debye
dipolederiv: -0.438174 -0.5070511 0.0000469 -0.436944 -1.1484842 0.0001633 0.0000838 0.0004225 -0.6529332 0.2073665 0.1190573 0.0000301 -0.3664219 -0.3064802 -0.0000121 0.0000167 -0.000002 -0.1480149 0.3836431 -0.0302852 0.0000189 0.0385582 -0.0843842 0.0000453 -0.0000369 0.0000174 0.0263957 0.1872101 0.5961556 -0.000066 0.5375411 1.1284156 -0.0001148 -0.0000823 -0.0000972 0.1279857 0.1605702 -0.0107769 0.0000051 0.241061 0.1472351 -0.000018 0.0000987 -0.0000223 -0.1134794 -0.1703311 0.0050203 -0.0732163 -0.0004471 -0.1238639 -0.0124159 -0.0267458 -0.00405 0.0532061 -0.1703237 0.0050344 0.0731982 -0.0004272 -0.1238262 0.0125399 0.026732 0.0042004 0.0532383 -0.1352484 -0.4498806 0.0000316 0.0373003 -0.1314693 0.0000037 0.0000215 -0.0000198 -0.2291675 -0.330361 0.0726423 -0.0000011 0.0843898 -0.1202789 0.0000154 -0.0000421 0.0000009 -0.2281831 0.1217209 0.0521604 -0.0000023 -0.1600333 0.2410165 -0.0000212 0.0000106 -0.0000068 -0.1359567 -0.023866 0.0081643 0.0795025 0.0115256 -0.1478229 -0.0003025 0.0627413 0.0049704 0.0819879 -0.0238746 0.008129 -0.0795427 0.0115199 -0.1478262 0.0005207 -0.0628017 -0.0047353 0.0819608 0.0871198 0.0125053 0.0000116 0.0029665 -0.1686563 0.0000532 0.0000303 0.0000389 -0.0674068 0.0452456 0.111288 0.0000004 0.1020231 -0.040346 0.000014 -0.0000014 0.0000048 0.1314953 0.0592929 -0.0064741 0.0941696 -0.0107479 0.1309537 0.0044003 0.0896004 0.0008209 -0.0372742 0.0593307 -0.0065635 -0.0941452 -0.0108209 0.1309566 -0.0045635 -0.0895558 -0.0009651 -0.037302 -0.00043 0.07244 -0.000007 0.1149368 -0.1089736 0.0000091 -0.0000104 0.0000146 0.1646096 0.0031285 -0.0859039 -0.0000065 -0.1050822 -0.0886511 -0.0000012 -0.0000104 0.0000018 0.1735931 -0.1634808 -0.0109866 -0.0000093 -0.0033302 0.0908258 0.0000002 -0.0000015 -0.0000033 0.1534007 -0.0006328 -0.0018872 -0.0898261 -0.0050972 0.1519599 -0.0035787 -0.1097326 -0.0018746 -0.0751854 -0.0006734 -0.001805 0.0898466 -0.0049964 0.1519668 0.0033555 0.1097529 0.0016613 -0.0751494 -0.1490024 -0.008078 -0.0000193 -0.010568 0.1603584 -0.0000381 -0.0000188 -0.0000342 0.0873682 0.1889209 0.0233411 -0.0000388 -0.0921921 0.210059 -0.0000165 -0.0000475 -0.0001546 0.3029921 0.1028489 0.033754 0.0000192 0.0252861 0.1973157 -0.000038 -0.0000008 -0.0001887 0.361819 unknown
polarizability: 183.4346868|7.049118|111.8991843|0.0027809|0.0182071|96.214424 unknown
InChI: InChI=1S/C12H11N/c13-12-9-5-4-8-11(12)10-6-2-1-3-7-10/h1-9H,13H2
charge 0 multiplicity 1
24 atoms
N  0.805744 -2.23617 0.000138
C  0.688467 0.214797 0.000019
C  -0.813526 0.157925 -0.00008
C  1.452567 -0.998489 0.000061
C  1.367973 1.454853 0.000043
C  -1.539659 0.126871 -1.221461
C  -1.539911 0.128036 1.221169
C  2.875786 -0.922781 0.000102
C  2.780105 1.527187 0.000082
C  3.527659 0.326018 0.00011
C  -2.953083 0.082395 -1.222546
C  -2.953339 0.083559 1.221997
C  -3.66452 0.060668 -0.000336
H  0.77237 2.375442 0.000009
H  -0.988548 0.148033 -2.168662
H  -0.989004 0.150067 2.168468
H  3.463408 -1.849638 0.000145
H  3.284614 2.498699 0.000087
H  4.623499 0.36073 0.000135
H  -3.496968 0.067504 -2.174055
H  -3.497419 0.069565 2.173408
H  -4.760001 0.028948 -0.000435
H  -0.209649 -2.283748 -0.000081
H  1.338734 -3.100171 -0.000119
