program: Gaussian 09
title: 000045657
version: EM64L-G09RevD.01
frameworkgroup: C1[X(C15H28N2)]
method: RPBEPBE
basis: SDD
operation: Freq
keyword: #p
keyword: freq=noraman
keyword: PBEPBE/SDD
title: #p freq=noraman PBEPBE/SDD
converged: YES YES NO NO
title: Mulliken charges:
elementType: N N C C C C C C C C C C C C C C C H H H H H H H H H H H H H H H H H H H H H H H H H H H H
charge: -0.115119 -0.232125 -0.312857 -0.427812 -0.568557 -0.540329 -0.554729 -0.545778 0.504165 0.515547 -0.553418 -0.551407 -0.590897 -0.410034 -0.442808 -0.336603 -0.341942 0.260937 0.266025 0.248292 0.244220 0.269470 0.237011 0.265197 0.277028 0.272016 0.276872 0.275789 0.265024 0.269488 0.272190 0.274645 0.273673 0.270434 0.276370 0.271575 0.283725 0.272446 0.277001 0.274723 0.279475 0.253746 0.273834 0.258178 0.265321
chargesum: 2.00000
title: Mulliken charges with hydrogens summed into heavy atoms:
elementType: N N C C C C C C C C C C C C C C C
charge: -0.115119 -0.232125 0.214105 0.064700 -0.062076 0.273912 0.262956 0.270545 0.504165 0.515547 0.267059 0.276338 0.240302 -0.151855 -0.177487 -0.082857 -0.068109
polarizability: 2.13317864e+02 1.82182160e+01 1.34935082e+02 8.24650153e-01 -1.81382979e+00 1.52710809e+02
1716.lowfreq: -12.6513 -0.0007 -0.0002 0.0002 3.2792 4.6716 11.1492 21.0390 27.5496
frequency: 3.9796 18.0534 27.4634 55.9843 77.3350 83.8556 143.3521 153.7128 170.2383 187.2777 220.4232 228.6415 246.3629 249.5384 261.2244 292.6599 324.8580 330.0383 340.4081 347.6574 351.2135 367.3477 399.8429 410.9956 429.9417 435.8303 453.2277 469.3774 513.4533 519.9860 570.7178 630.6333 638.5333 717.8382 727.7148 762.6708 800.0255 816.5720 837.3523 839.5552 855.3357 899.8793 912.4987 918.4280 929.8178 935.6099 968.4092 982.1169 991.2759 1006.6586 1038.9097 1042.2188 1043.3452 1062.0241 1093.1786 1103.4452 1104.1153 1106.9977 1109.8619 1147.9216 1173.3433 1201.0511 1210.6536 1212.3021 1217.3220 1221.1428 1232.4743 1245.7935 1251.3038 1271.6729 1313.9760 1321.9188 1331.2537 1346.9367 1375.5251 1385.3715 1410.2378 1417.6527 1421.8590 1422.5145 1422.6989 1448.8463 1451.0817 1453.1939 1455.6716 1458.3125 1460.5611 1462.6236 1464.6812 1468.2341 1470.7593 1479.1548 1479.5206 1486.7856 1487.8114 1488.2359 1498.6072 1499.4609 1499.7732 1594.0616 1611.0370 2996.2012 3006.1605 3017.0713 3025.0831 3028.4442 3031.1943 3031.9211 3032.5256 3035.3268 3052.1787 3064.8567 3093.8916 3136.5667 3141.1300 3142.6527 3144.3773 3145.8086 3146.7967 3147.2156 3148.3345 3153.5558 3154.3067 3155.7349 3157.4382 3158.8067 3161.9282 3166.3079 3184.8922
redmass: 2.8295 2.9357 3.8396 3.2923 3.0640 1.7784 2.1099 1.3179 2.5207 1.3528 2.9114 1.8780 1.0639 1.1905 1.0649 2.8452 1.9085 1.2852 2.2590 2.8340 2.7447 2.5396 2.6318 2.7525 2.3626 2.5168 3.1234 3.0655 2.8868 3.0085 2.5371 6.1334 3.6564 2.7690 3.8174 2.5463 1.7996 3.1158 1.7171 1.2524 2.2991 2.3956 2.6146 2.8561 2.7796 2.8389 1.3803 1.3815 2.7667 2.8934 1.6217 1.1914 1.2153 2.2521 1.3420 1.3138 1.3368 2.3712 1.6481 1.3913 1.2739 1.5459 1.8383 1.2403 1.8837 1.8451 1.5811 1.8901 1.9461 1.4119 1.3264 1.1997 1.2955 1.4385 1.3373 5.4119 2.2977 1.1636 1.1347 1.1455 1.1464 1.0913 1.0487 1.0545 1.1473 1.0934 1.0433 1.0497 1.0827 1.0802 1.0867 1.0881 1.0559 1.0528 1.0481 1.0559 1.0733 1.2236 1.6541 6.7597 6.1823 1.0611 1.0609 1.0580 1.0326 1.0325 1.0318 1.0320 1.0339 1.0331 1.1003 1.1033 1.1075 1.0889 1.1056 1.1059 1.0917 1.1053 1.1056 1.1056 1.1054 1.1056 1.1054 1.1058 1.0984 1.1049 1.1057 1.1034 1.0944
irintensity: 0.2277 0.9126 1.8606 0.3112 3.0791 0.7238 0.2086 0.2115 0.1415 0.1146 1.5070 0.0819 0.2012 0.1978 0.0369 1.3739 1.1136 0.3746 0.4291 0.6922 0.2313 0.0976 0.8511 0.2611 0.7634 0.6773 0.4302 1.3823 0.7081 5.1148 35.2950 0.1493 1.8157 3.0769 1.4872 5.1177 20.9911 26.2408 25.9268 0.2599 7.5923 23.9169 52.0441 10.4449 17.0013 13.9579 1.9015 0.1990 11.7155 5.5660 6.1705 0.0589 0.2211 2.6868 0.7010 1.5696 0.8551 5.3741 2.6838 7.3028 0.7740 0.8733 0.2534 3.6253 0.4874 0.8941 0.4137 0.8785 5.7582 0.8261 1.9777 1.4573 4.4395 4.3139 4.3374 0.7933 4.7452 23.4085 18.7673 20.1847 17.6639 1.9049 0.6936 1.1203 4.3047 7.3820 1.9044 2.6704 2.3334 8.1769 14.4267 2.0631 44.8030 51.2675 41.8670 46.6871 152.4321 79.0524 6.4464 1.8640 1.4088 7.7200 7.1332 10.0998 3.3343 2.2231 1.8965 1.8076 0.2020 0.9109 5.9382 11.5119 17.3563 7.8849 0.8730 0.1249 5.1875 3.5260 0.3544 0.1903 6.4686 8.8058 1.3991 0.9346 0.8980 5.1766 1.1167 4.1863 0.3419
temp: 298.150 k
press: 1.00000 atm
elementType: 7 7 6 6 6 6 6 6 6 6 6 6 6 6 6 6 6 1 1 1 1 1 1 1 1 1 1 1 1 1 1 1 1 1 1 1 1 1 1 1 1 1 1 1 1
symmnumber: 1
zpe: 1074809.2 jmol-1
zpe.correction: 0.409373 hartree
zpe.thermalcorrener: 0.429146 hartree
zpe.thermalcorrenthalpy: 0.430090 hartree
zpe.thermalcorrgfe: 0.358471 hartree
zpe.sumelectzpe: -695.969684 hartree
zpe.sumelectthermal: -695.949911 hartree
zpe.sumelectthermalent: -695.948967 hartree
zpe.sumelectthermalfe: -696.020586 hartree
dipole: -1.6737 3.6446 0.0592
dipole: 4.0110
quadrupole: 84.4603 -84.6715 -82.3157
quadrupole: 1.1242 -0.7202 -0.2273
quadrupole: 111.9693 -57.1625 -54.8067 1.1242 -0.7202 -0.2273
hfenergy: -696.3790569 hartree
pointgroup: C01 [X(C15H28N2)]
dipole: -0.6614937 -1.3589074 0.453862 debye
polarizability: 213.1909891|-18.0742328|135.9798919|4.0020187|4.2972079|151.7928741 unknown
InChI: InChI=1S/C15H28N2/c1-16(2,3)13-7-8-14-9-11-15(12-10-14)17(4,5)6/h9-12H,7-8,13H2,1-6H3
charge 2 multiplicity 1
45 atoms
N  -4.339548 -0.682454 0.24125
N  4.072702 -0.612114 0.104675
C  -3.011413 -0.168053 -0.385582
C  -2.506609 1.18432 0.147351
C  -1.293236 1.707144 -0.684525
C  -4.637607 -2.062806 -0.354409
C  -4.214284 -0.815429 1.758825
C  -5.503439 0.253826 -0.093884
C  0.043478 1.002782 -0.46408
C  2.648645 -0.092662 -0.109896
C  4.080161 -1.683629 1.207875
C  4.986668 0.557733 0.515667
C  4.667952 -1.243243 -1.157328
C  0.687626 1.03842 0.802356
C  0.731505 0.385053 -1.536167
C  1.976708 0.499862 0.985414
C  2.026283 -0.161464 -1.371857
H  -3.204983 -0.105683 -1.471676
H  -2.267633 -0.965736 -0.210412
H  -3.30035 1.949626 0.074971
H  -2.21671 1.108121 1.211041
H  -1.165274 2.775025 -0.423434
H  -1.552152 1.689477 -1.759656
H  -3.82107 -2.753368 -0.09385
H  -5.586262 -2.437835 0.058886
H  -4.720641 -1.973953 -1.448352
H  -4.088164 0.179523 2.207975
H  -5.132449 -1.279033 2.150763
H  -3.347643 -1.452076 1.994348
H  -5.341612 1.233582 0.37655
H  -5.573724 0.365483 -1.186644
H  -6.434136 -0.187361 0.29436
H  5.111494 -2.044271 1.342771
H  3.71628 -1.248305 2.148149
H  3.423904 -2.510539 0.89921
H  6.008682 0.173582 0.65598
H  4.967643 1.314953 -0.281742
H  4.62158 0.997503 1.45365
H  5.680857 -1.597129 -0.91385
H  4.049054 -2.095711 -1.472687
H  4.729333 -0.489455 -1.955287
H  2.438431 0.575901 1.975339
H  2.513105 -0.608507 -2.24119
H  0.201283 1.528449 1.653594
H  0.274263 0.352952 -2.531389
