program: Gaussian 09
title: 000045605
version: EM64L-G09RevD.01
frameworkgroup: C1[X(C13H18N2)]
method: RPBEPBE
basis: SDD
operation: Freq
keyword: #pfreq=noraman
keyword: PBEPBE/SDD
title: #p freq=noraman PBEPBE/SDD
converged: YES YES NO NO
title: Mulliken charges:
elementType: N N C C C C C C C C C C C C C H H H H H H H H H H H H H H H H H H
charge: -0.277187 -0.408645 -0.566519 0.397108 -0.372875 0.110791 0.227618 -0.444894 -0.325311 -0.375697 -0.408528 -0.352927 -0.260079 -0.218402 -0.680255 0.196265 0.230034 0.198906 0.219545 0.269050 0.235113 0.202789 0.170762 0.302640 0.184004 0.219193 0.229049 0.225170 0.218277 0.219766 0.209269 0.207960 0.218008
chargesum: 0.00000
title: Mulliken charges with hydrogens summed into heavy atoms:
elementType: N N C C C C C C C C C C C C C
charge: -0.042074 -0.106005 -0.140220 0.397108 0.045576 0.110791 0.227618 -0.175844 0.048241 0.027500 -0.179479 -0.127757 -0.041802 0.001365 -0.045018
polarizability: 1.95042099e+02 -1.13677045e+01 1.67463364e+02 1.66403401e+01 6.82226814e+00 9.90519628e+01
1716.lowfreq: -6.6577 -0.0008 -0.0004 -0.0003 4.4449 5.3968 25.4269 44.5665 50.3174
frequency: 25.2576 44.5099 50.2543 66.2012 110.7852 128.0092 139.0690 186.1810 218.6916 224.1676 234.1749 247.6316 327.8664 420.8465 427.2854 447.5386 460.3659 500.7361 539.0677 576.0281 583.8960 632.8746 681.0236 735.8663 746.9115 748.3493 756.4132 769.2140 790.9918 806.5421 848.3843 867.2462 885.4326 897.5314 929.1085 968.1424 992.9983 1011.0523 1030.7984 1036.1199 1066.4341 1071.5148 1093.3991 1122.9814 1128.4996 1135.2851 1143.8263 1167.2272 1198.7059 1230.5891 1239.8261 1250.9693 1271.0434 1280.9262 1283.6387 1296.0266 1312.1270 1346.9380 1350.3068 1384.1385 1390.7949 1392.4619 1420.5531 1450.3332 1459.8666 1467.4987 1472.4424 1478.8318 1481.8209 1482.1581 1489.7063 1498.6918 1564.6936 1586.8780 1631.5160 2841.4852 2864.9812 2956.9946 2967.1183 2974.7053 2993.8709 3009.2509 3036.1373 3045.4358 3071.6640 3075.5258 3121.3314 3129.0556 3143.0672 3161.0166 3219.4878 3411.2380 3614.5858
redmass: 3.8119 2.5435 2.1469 3.1066 3.1400 2.0392 2.4808 3.8395 3.9896 1.2161 2.5671 3.4553 4.5499 3.0051 3.1383 4.1145 3.4086 1.2213 5.7826 3.1123 4.4301 3.0575 1.3636 3.6420 1.3492 3.5029 1.0876 3.3927 1.3487 1.5282 1.4903 5.0681 1.1926 1.7029 1.3822 1.2967 2.4819 2.1646 2.1299 3.3430 2.5269 2.8267 1.5738 1.3011 2.1476 1.5620 3.7155 1.1009 1.5866 1.5404 1.8996 1.3759 1.3423 1.1546 1.1598 1.7451 1.5200 1.5634 1.6613 1.4278 3.4627 1.4206 2.3432 1.2182 4.2090 1.0952 1.0633 1.0438 2.8953 1.0879 1.0888 1.0844 6.3161 6.2114 6.8854 1.0715 1.0711 1.0665 1.0656 1.0364 1.0835 1.0857 1.0979 1.0963 1.1008 1.0991 1.0845 1.0888 1.0952 1.1001 1.0983 1.0737 1.0809
irintensity: 0.7904 1.6456 0.0659 0.0355 1.1543 2.8741 1.6249 2.0482 8.5256 0.0288 1.2996 0.2579 0.5797 5.3652 9.8839 0.4009 3.5518 101.1398 0.7620 8.1914 7.5400 6.3289 86.1035 2.3781 113.1617 3.9180 7.9581 9.1651 6.4281 16.0632 0.1321 0.7472 3.8652 1.6453 2.4817 0.0394 4.2398 12.2433 9.4894 1.2022 5.5044 5.0212 46.2907 2.8571 5.5270 17.7460 59.1196 0.5684 1.4130 1.1281 23.8393 2.0201 0.6360 0.5231 1.9861 1.6975 2.4746 3.0721 33.4146 4.3440 34.5999 8.5259 2.6093 35.2412 19.8493 8.2050 6.1865 13.1804 2.1734 3.6305 9.9960 7.0310 1.9365 0.1760 2.1032 88.1868 122.3020 34.5201 29.6721 35.6896 39.6059 30.4521 12.2340 31.9348 78.2854 53.6458 2.1587 5.0409 43.5935 29.0148 1.3670 2.8825 58.4806
temp: 298.150 k
press: 1.00000 atm
elementType: 7 7 6 6 6 6 6 6 6 6 6 6 6 6 6 1 1 1 1 1 1 1 1 1 1 1 1 1 1 1 1 1 1
symmnumber: 1
zpe: 743916.7 jmol-1
zpe.correction: 0.283343 hartree
zpe.thermalcorrener: 0.298256 hartree
zpe.thermalcorrenthalpy: 0.299200 hartree
zpe.thermalcorrgfe: 0.239643 hartree
zpe.sumelectzpe: -614.560262 hartree
zpe.sumelectthermal: -614.545349 hartree
zpe.sumelectthermalent: -614.544405 hartree
zpe.sumelectthermalfe: -614.603962 hartree
dipole: -0.7260 -0.9498 -0.6314
dipole: 1.3520
quadrupole: -81.9921 -82.1790 -93.2951
quadrupole: 10.0086 5.5373 5.0666
quadrupole: 3.8300 3.6430 -7.4730 10.0086 5.5373 5.0666
hfenergy: -614.8436052 hartree
pointgroup: C01 [X(C13H18N2)]
dipole: -0.2712959 0.4052828 0.2123042 debye
polarizability: 195.7901089|8.7632205|167.451954|-17.4112291|1.073311|98.3153638 unknown
InChI: InChI=1S/C13H18N2/c1-2-8-14-9-7-11-10-15-13-6-4-3-5-12(11)13/h3-6,10,14-15H,2,7-9H2,1H3
charge 0 multiplicity 1
33 atoms
N  3.041028 0.19311 -0.473645
N  -2.651962 1.971174 0.314706
C  0.704795 0.889646 -0.975681
C  -0.708382 1.044193 -0.470067
C  1.677224 0.313725 0.0851
C  -1.66961 -0.020179 -0.220396
C  -2.879146 0.590953 0.270173
C  -1.347083 2.237461 -0.133408
C  4.056807 -0.319013 0.472116
C  5.44689 -0.39816 -0.189546
C  -1.630201 -1.43235 -0.373826
C  -4.025967 -0.161802 0.607778
C  -2.770477 -2.188972 -0.04141
C  -3.955475 -1.560539 0.446182
C  6.531808 -0.925404 0.773828
H  0.71417 0.220134 -1.862263
H  1.108292 1.861971 -1.313021
H  1.273992 -0.656074 0.471475
H  1.717546 1.003376 0.950382
H  -0.967711 3.256893 -0.182814
H  3.03811 -0.357193 -1.345886
H  4.101817 0.376924 1.334259
H  3.791748 -1.324791 0.891223
H  -3.327551 2.671432 0.610941
H  5.390752 -1.059397 -1.079804
H  5.716199 0.608756 -0.560733
H  -0.726674 -1.927176 -0.748316
H  -4.939461 0.315638 0.980406
H  -2.753652 -3.278618 -0.156259
H  -4.826094 -2.176558 0.698099
H  6.626897 -0.270469 1.660426
H  6.288072 -1.943316 1.132638
H  7.519298 -0.968573 0.279645
