program: Gaussian 09
title: 000007012
version: EM64L-G09RevD.01
frameworkgroup: C1[X(C10H12O2)]
method: RPBEPBE
basis: SDD
operation: Freq
keyword: #pfreq=noraman
keyword: PBEPBE/SDD
title: #p freq=noraman PBEPBE/SDD
converged: YES YES NO NO
title: Mulliken charges:
elementType: O O C C C C C C C C C C H H H H H H H H H H H H
charge: -0.409447 -0.237542 -0.301473 -0.385142 0.482698 -0.690118 0.154028 -0.376963 -0.435940 -0.234203 -0.221260 -0.242426 0.240442 0.210584 0.230016 0.236673 0.205483 0.220488 0.261798 0.234428 0.226354 0.226600 0.229123 0.375799
chargesum: 0.00000
title: Mulliken charges with hydrogens summed into heavy atoms:
elementType: O O C C C C C C C C C C
charge: -0.033647 -0.237542 -0.061031 0.055458 0.482698 -0.027474 0.154028 -0.115164 -0.201513 -0.007849 0.005340 -0.013303
polarizability: 1.32995185e+02 2.72964296e+00 8.55116151e+01 -1.46064002e+00 8.39748054e+00 1.06773595e+02
1716.lowfreq: -8.4701 -5.6571 -0.0005 -0.0002 0.0003 5.4830 37.5966 43.3769 72.1238
frequency: 37.5829 43.3734 72.0988 109.1008 153.0395 161.8667 226.9359 253.8527 323.0134 344.2184 404.5986 410.6287 492.4768 561.0913 603.5351 617.0580 631.4094 704.5910 711.6554 740.1146 773.9724 833.9656 855.2607 882.0598 910.4045 941.6485 978.7598 990.0758 997.0227 1025.1577 1034.4757 1052.7315 1077.1764 1085.2202 1119.2212 1172.5083 1191.4895 1192.9276 1229.9601 1238.1725 1297.7987 1317.8604 1338.9887 1354.0160 1385.1691 1392.9696 1442.6897 1467.5939 1475.5145 1481.5500 1483.9978 1593.4456 1609.9457 1655.0795 2979.6037 2993.2566 3033.5211 3052.4509 3076.2894 3085.4818 3120.7457 3126.4871 3138.0267 3148.1029 3164.0055 3502.0099
redmass: 4.4980 6.1395 2.9341 3.1592 3.1240 2.3104 1.6481 2.6618 5.5082 3.9034 2.8386 3.7139 3.4241 2.7850 3.1344 4.3912 1.8185 1.8954 3.6756 1.6635 2.0419 1.8002 1.2464 2.5999 1.8191 2.2799 1.3996 5.4034 1.3495 2.2583 1.8707 2.2681 1.7351 1.9838 2.0477 1.0604 1.1300 2.3546 1.4468 1.3284 1.3637 1.5126 1.2794 1.7309 5.8442 1.2154 2.1418 1.0759 1.0438 2.0104 1.1131 6.0405 5.9881 8.2276 1.0363 1.0621 1.0876 1.0966 1.0991 1.1005 1.0855 1.0872 1.0919 1.0963 1.1016 1.0638
irintensity: 1.0477 1.5712 0.0910 1.0459 0.5514 0.7565 0.3867 0.2081 2.4032 6.0496 0.0622 4.0429 1.2644 39.3574 45.9373 19.9555 84.4120 55.9552 30.8341 22.1054 38.1807 7.9655 0.1300 2.8113 14.9107 9.4511 0.0263 0.6428 0.0410 28.0346 117.7564 107.7560 7.7193 16.2550 35.8798 0.2267 0.0937 0.7305 1.7761 2.3596 4.3154 29.5951 3.3533 35.7142 2.6629 13.7587 11.4490 5.5744 11.6663 13.0873 15.3704 2.3504 9.6964 184.3515 29.0410 28.3005 3.4126 7.1507 45.2920 51.2774 4.3320 0.4101 15.7088 31.2089 22.4752 20.4003
temp: 298.150 k
press: 1.00000 atm
elementType: 8 8 6 6 6 6 6 6 6 6 6 6 1 1 1 1 1 1 1 1 1 1 1 1
symmnumber: 1
zpe: 513802.4 jmol-1
zpe.correction: 0.195697 hartree
zpe.thermalcorrener: 0.207392 hartree
zpe.thermalcorrenthalpy: 0.208336 hartree
zpe.thermalcorrgfe: 0.156780 hartree
zpe.sumelectzpe: -537.831172 hartree
zpe.sumelectthermal: -537.819477 hartree
zpe.sumelectthermalent: -537.818533 hartree
zpe.sumelectthermalfe: -537.870089 hartree
dipole: -0.5022 0.5729 1.1512
dipole: 1.3805
quadrupole: -65.4850 -69.6186 -71.1767
quadrupole: 0.4053 3.5410 -0.6249
quadrupole: 3.2751 -0.8585 -2.4166 0.4053 3.5410 -0.6249
hfenergy: -538.0268687 hartree
pointgroup: C01 [X(C10H12O2)]
dipole: -0.1563725 0.0507322 0.5176499 debye
dipolederiv: -0.5714891 0.2487391 -0.2257007 0.3441929 -0.8674961 0.4103051 -0.2293771 0.3655506 -0.4917957 -0.4950949 0.1091194 0.1856987 0.2185857 -0.552659 -0.0786587 0.1299304 0.1413507 -0.8830699 -0.1477545 0.1369464 0.1202949 0.0193983 -0.1267531 -0.0578901 0.1794974 -0.055657 0.0498547 0.0782901 0.0378838 0.0334445 0.0711535 0.1954315 0.0296598 0.0189354 -0.0397975 0.0565277 0.3714577 0.0375709 -0.0225889 0.1175425 -0.0913285 -0.0262449 0.0776801 -0.0279342 -0.0594592 0.032919 0.0002728 0.0296758 0.0301105 -0.0636041 -0.0671197 0.0435859 -0.0135112 0.079601 0.6616325 -0.5793851 -0.1063032 -0.783535 1.1046724 -0.2135818 -0.1427518 -0.3207458 1.1588694 -0.1266187 0.0056997 -0.0573503 0.0031992 -0.143073 -0.0110955 -0.0906751 -0.0202268 -0.0183399 -0.1380592 0.006014 0.0682337 0.0166657 -0.1497643 -0.0075287 0.0229908 -0.0007666 0.0667204 -0.0052715 0.0162396 0.0695869 -0.0016662 -0.143842 -0.0036888 0.0821423 -0.0062844 0.1189565 0.0034508 0.030527 -0.0800498 0.0156464 -0.1292829 -0.0234235 -0.0862144 -0.0334495 0.0680059 0.0776215 0.0308224 0.019009 0.0351471 -0.1620487 -0.0043106 0.0210116 -0.0049212 -0.0728916 0.0485729 -0.0116744 -0.004012 0.0087521 0.0438897 0.0141522 -0.0543384 0.0278299 -0.0904789 -0.2123662 -0.026032 0.0067779 -0.040907 0.0159888 -0.0068626 -0.0111065 -0.0080313 0.0801363 0.084045 0.0175317 -0.0597738 0.00481 0.0336037 -0.0244026 -0.0392298 0.0148577 -0.1076739 -0.14837 0.0254738 0.000834 0.0110067 0.1191508 -0.0000964 -0.0121762 -0.0120792 0.0583422 0.0658867 0.0203245 -0.0540205 0.0330643 0.0780718 0.0607932 -0.0553767 -0.0160041 -0.1554224 0.0661948 -0.0703968 0.0240969 -0.0757382 -0.1772312 0.0304845 0.0361758 0.064325 0.068128 0.0628084 -0.0258182 0.0842906 -0.0119196 0.138015 0.02063 0.0796453 0.0239314 0.0171318 0.0417572 -0.0067593 -0.1033104 -0.0021331 0.1425732 -0.0050884 -0.0755419 0.0000982 -0.0596487 0.0336433 -0.0121734 -0.0732062 -0.0103041 0.1521717 0.0049448 -0.0937561 0.0022259 -0.0875765 -0.000544 -0.0293166 0.0945344 -0.0320525 0.150353 0.0286733 0.1072115 0.0320981 -0.0534113 -0.1335104 -0.0409566 -0.022601 -0.03475 0.1539579 0.0011093 -0.0233164 0.0014795 0.0883591 0.3507986 0.0793473 0.0724397 0.0637309 0.2792034 -0.07076 0.115054 -0.1143383 0.169135 unknown
polarizability: 132.6723709|3.734928|82.7068446|-2.3034318|-0.8944115|109.9011797 unknown
InChI: InChI=1S/C10H12O2/c1-2-9(10(11)12)8-6-4-3-5-7-8/h3-7,9,11H,2H2,1H3
charge 0 multiplicity 1
24 atoms
O  2.487586 -1.79595 0.315927
O  2.233396 -0.735651 -1.731547
C  1.244809 0.282004 0.307963
C  1.672526 1.715516 -0.133152
C  -0.263603 0.039457 0.138579
C  1.025843 2.818173 0.72819
C  2.018452 -0.755288 -0.498578
C  -0.858261 0.043042 -1.150214
C  -1.085897 -0.16398 1.273649
C  -2.249829 -0.146954 -1.295339
C  -2.479788 -0.352097 1.129202
C  -3.066515 -0.343005 -0.156657
H  1.507798 0.135341 1.370675
H  2.775798 1.790516 -0.069042
H  1.4101 1.85208 -1.1983
H  -0.076074 2.785917 0.661648
H  1.304462 2.710364 1.793626
H  1.358444 3.817227 0.393259
H  -0.228011 0.178538 -2.0370
H  -0.634894 -0.175871 2.273181
H  -2.697035 -0.145654 -2.295849
H  -3.103729 -0.506611 2.016732
H  -4.146327 -0.490117 -0.271081
H  2.954051 -2.469398 -0.251572
