program: Gaussian 09
title: 000045603
version: EM64L-G09RevD.01
frameworkgroup: C1[X(C18H20N2)]
method: RPBEPBE
basis: SDD
operation: Freq
keyword: #pfreq=noraman
keyword: PBEPBE/SDD
title: #p freq=noraman PBEPBE/SDD
converged: YES YES NO NO
title: Mulliken charges:
elementType: N N C C C C C C C C C C C C C C C C C C H H H H H H H H H H H H H H H H H H H H
charge: -0.339597 -0.408411 -0.561350 -0.380227 0.402761 -0.204371 0.109283 0.225193 0.483632 -0.452175 -0.732504 -0.403872 -0.353396 -0.379604 -0.448873 -0.260994 -0.217820 -0.232528 -0.221785 -0.245842 0.227138 0.191998 0.242054 0.205126 0.196634 0.247251 0.266221 0.301899 0.231636 0.205095 0.235978 0.237937 0.224645 0.270876 0.230045 0.219523 0.219442 0.222247 0.221757 0.224980
chargesum: 0.00000
title: Mulliken charges with hydrogens summed into heavy atoms:
elementType: N N C C C C C C C C C C C C C C C C C C
charge: -0.092346 -0.106511 -0.142214 0.066953 0.402761 -0.007738 0.109283 0.225193 0.483632 -0.185954 -0.059796 -0.165935 -0.128751 -0.108728 -0.218828 -0.041471 0.001622 -0.010280 -0.000028 -0.020862
polarizability: 2.06370654e+02 -2.90556628e+00 2.47469609e+02 6.60589410e+00 -7.25545605e+00 1.44274063e+02
1716.lowfreq: -8.2230 -2.7712 -0.0007 -0.0006 -0.0005 4.6319 11.8285 18.2544 34.8347
frequency: 10.6560 18.0734 34.8168 54.4901 60.4705 110.6405 133.4184 158.8241 187.1798 209.4330 218.2414 238.0746 243.8678 257.0110 307.8436 358.1931 405.8993 422.7160 439.4052 464.3411 473.9226 496.6563 535.8232 545.9895 572.8182 575.5706 591.4984 616.1263 633.3428 663.7807 708.7824 731.2051 747.8231 748.5657 756.5287 770.6139 771.4545 791.3482 804.3491 850.8918 859.9674 867.2608 922.8086 928.5892 931.3827 970.4022 982.4892 987.2988 992.2660 999.3377 1011.1911 1018.7384 1023.9035 1032.2430 1068.3611 1071.3479 1083.1873 1094.3821 1119.1040 1134.2286 1145.4543 1164.4991 1168.5133 1174.4093 1181.1340 1222.6562 1234.2578 1248.1308 1271.3890 1278.5502 1292.4634 1301.5456 1312.2717 1342.9156 1349.8801 1368.6468 1380.7252 1388.3059 1390.5193 1420.6379 1440.4912 1450.9522 1459.4710 1468.5610 1470.7003 1472.4848 1481.9398 1485.4052 1494.6445 1565.4146 1587.2764 1594.5824 1612.6255 1631.5824 2842.1858 2875.7272 2969.7289 2975.2850 3018.7345 3041.3241 3070.5848 3096.9017 3107.5643 3119.6374 3121.2355 3128.5956 3132.6876 3142.5532 3143.7597 3159.0020 3160.8969 3217.1463 3436.1451 3614.6659
redmass: 4.8730 4.8633 3.8271 3.9120 4.4223 2.4106 3.1888 2.9668 3.6204 1.8411 3.9099 2.4704 1.7141 3.5509 3.4953 4.7228 2.8637 2.8598 3.7240 3.3770 3.5017 1.2310 4.7229 3.1140 3.0940 3.0168 3.1732 6.2095 3.2363 1.8595 1.7574 3.8111 1.7146 2.2835 3.4656 3.0439 1.9403 1.4227 1.4509 1.4801 1.2531 5.0009 1.7564 1.4418 1.3833 1.2994 1.4161 2.8406 3.1468 1.3369 2.0635 2.0423 2.0998 2.9540 2.3068 1.9108 2.4438 1.5664 1.9463 1.6772 2.9385 1.1770 1.0699 1.1542 1.2553 1.9338 2.0936 1.4823 1.3118 1.4307 1.5218 1.4427 1.5971 1.4484 1.7738 1.4598 1.2139 4.8551 5.1547 2.3864 2.1143 1.1969 4.1013 1.1150 1.3230 1.0750 3.0441 1.6475 1.0848 6.3065 6.2110 6.1568 6.1583 6.8680 1.0815 1.0718 1.0604 1.0371 1.0933 1.0949 1.0976 1.0999 1.0873 1.0858 1.0848 1.0891 1.0911 1.0953 1.0953 1.1013 1.1001 1.0982 1.0744 1.0808
irintensity: 0.1819 0.1366 0.1841 0.7340 0.2433 2.2618 1.0119 0.2515 1.6227 1.4400 7.5008 1.1912 2.4028 1.5655 0.9657 0.4815 0.1104 10.2508 7.2493 2.0962 0.6644 103.2829 9.7162 24.7695 13.6467 12.9160 7.7119 0.3027 2.7997 39.7795 62.1185 0.6974 77.2514 39.6320 2.5297 13.1358 43.6305 9.6670 11.8680 0.3865 0.6837 1.0866 0.5871 8.8211 3.0586 0.0185 1.2301 2.6633 3.0876 2.9976 7.9448 7.9454 8.1522 5.2949 5.6814 9.7016 9.4406 37.9149 1.0739 11.8074 45.2457 14.3776 0.6873 14.4070 13.6909 9.6788 9.2675 3.7812 17.3864 5.4651 5.0893 8.1203 13.0728 19.4912 21.5022 0.6427 19.7916 8.0548 32.3700 2.6920 18.1585 17.0751 18.8006 2.3741 9.8543 6.2078 2.3905 10.2235 4.1287 3.1863 0.1146 0.7861 4.9827 2.5956 68.8052 84.3283 42.6243 43.5995 7.7225 37.7573 41.7731 22.0925 10.2962 0.2687 1.9330 4.3399 17.1643 40.6887 32.3585 26.4904 28.3117 1.8180 2.7710 59.1505
temp: 298.150 k
press: 1.00000 atm
elementType: 7 7 6 6 6 6 6 6 6 6 6 6 6 6 6 6 6 6 6 6 1 1 1 1 1 1 1 1 1 1 1 1 1 1 1 1 1 1 1 1
symmnumber: 1
zpe: 879533.8 jmol-1
zpe.correction: 0.334997 hartree
zpe.thermalcorrener: 0.352950 hartree
zpe.thermalcorrenthalpy: 0.353894 hartree
zpe.thermalcorrgfe: 0.286053 hartree
zpe.sumelectzpe: -805.985102 hartree
zpe.sumelectthermal: -805.967149 hartree
zpe.sumelectthermalent: -805.966205 hartree
zpe.sumelectthermalfe: -806.034045 hartree
dipole: 1.3575 -2.3768 1.3578
dipole: 3.0554
quadrupole: -105.1973 -103.7336 -119.4189
quadrupole: -6.1381 4.0274 -3.6087
quadrupole: 4.2526 5.7163 -9.9690 -6.1381 4.0274 -3.6087
hfenergy: -806.3200983 hartree
pointgroup: C01 [X(C18H20N2)]
dipole: -0.4571059 0.9765351 0.5314348 debye
polarizability: 205.6753672|-0.2632476|247.9278511|-8.2511689|5.664124|144.5111074 unknown
InChI: InChI=1S/C18H20N2/c1-14(15-7-3-2-4-8-15)19-12-11-16-13-20-18-10-6-5-9-17(16)18/h2-10,13-14,19-20H,11-12H2,1H3
charge 0 multiplicity 1
40 atoms
N  1.783115 1.911244 -0.497087
N  -4.123944 1.630566 0.680713
C  -0.687044 1.96162 -0.799283
C  0.490233 1.549701 0.121002
C  -2.034722 1.553441 -0.257606
C  2.992962 1.457236 0.226064
C  -2.560134 0.198464 -0.169116
C  -3.871373 0.278081 0.422954
C  3.168881 -0.0638 0.116665
C  -3.017685 2.391935 0.267103
C  4.228043 2.182448 -0.364073
C  -2.052209 -1.075391 -0.541683
C  -4.671346 -0.86406 0.649486
C  2.839143 -0.743535 -1.082509
C  3.720507 -0.801875 1.192069
C  -2.844915 -2.217887 -0.319764
C  -4.139998 -2.113801 0.270686
C  3.061855 -2.132895 -1.20503
C  3.948094 -2.192366 1.072386
C  3.620135 -2.862892 -0.128621
H  -0.509152 1.504751 -1.792561
H  -0.661147 3.060382 -0.948217
H  0.475517 0.454666 0.270502
H  0.344283 2.009407 1.129644
H  2.939573 1.709565 1.31649
H  1.833188 2.914832 -0.719495
H  -3.011529 3.475547 0.374763
H  -4.976731 2.00427 1.090045
H  5.153814 1.842413 0.130445
H  4.145777 3.278486 -0.227634
H  4.311665 1.967058 -1.444265
H  -1.058614 -1.170437 -0.994754
H  -5.667449 -0.789845 1.100692
H  2.394623 -0.163993 -1.899813
H  3.968436 -0.287303 2.129791
H  -2.464741 -3.206164 -0.601372
H  -4.731939 -3.021839 0.432059
H  2.800465 -2.648089 -2.136958
H  4.372839 -2.751614 1.914112
H  3.791423 -3.941429 -0.222329
