program: Gaussian 09
title: 000045574
version: EM64L-G09RevD.01
frameworkgroup: C1[X(C6H12F2O2)]
method: RPBEPBE
basis: SDD
operation: Freq
keyword: #p
keyword: freq=noraman
keyword: PBEPBE/SDD
title: #p freq=noraman PBEPBE/SDD
converged: YES YES NO NO
title: Mulliken charges:
elementType: F F O O C C C C C C H H H H H H H H H H H H
charge: -0.240725 -0.240725 -0.281600 -0.281601 -0.267484 -0.267484 -0.219311 -0.219311 -0.212000 -0.212000 0.200478 0.212990 0.200476 0.212992 0.183929 0.216076 0.183930 0.216075 0.190346 0.217302 0.190346 0.217302
chargesum: 0.00000
title: Mulliken charges with hydrogens summed into heavy atoms:
elementType: F F O O C C C C C C
charge: -0.240725 -0.240725 -0.281600 -0.281601 0.145984 0.145984 0.180693 0.180694 0.195648 0.195649
polarizability: 9.70804316e+01 -1.65634834e-05 6.26698467e+01 1.94463059e+00 6.48957986e-05 6.38719228e+01
1716.lowfreq: -20.9481 -5.8524 -4.8978 -0.0011 -0.0011 -0.0008 20.5798 37.2900 52.6314
frequency: 20.5075 37.2876 52.3357 75.5495 91.6331 101.8097 147.6200 153.8760 197.8011 264.0691 301.7106 386.9461 393.0702 509.3783 517.4990 811.7651 830.6916 842.5820 844.9901 864.5460 1000.9922 1012.6605 1016.2148 1017.5003 1063.9267 1083.9246 1103.0000 1105.0266 1116.7469 1123.1258 1168.5039 1189.7900 1192.7232 1244.3765 1245.8655 1255.7117 1309.8277 1351.2309 1370.4409 1376.6111 1396.1078 1421.3153 1447.0144 1447.1391 1453.7935 1455.3364 1484.1050 1492.6982 2919.0778 2919.7088 2942.8490 2947.1173 2980.9872 2981.4836 2989.2856 3019.1078 3019.3846 3019.5631 3093.2234 3093.2480
redmass: 5.8617 4.1226 5.0847 2.5686 2.7890 4.4500 4.1908 4.2298 2.5436 3.7146 2.6113 3.6527 3.1162 2.7824 2.8306 3.1566 1.2921 2.1702 2.9591 2.5819 2.9795 4.5199 2.5770 2.6689 2.6228 2.5757 3.6840 2.5050 1.8162 2.3540 1.1135 1.1053 1.1307 1.1026 1.1131 1.1497 1.2027 1.2823 1.2369 1.2907 1.4810 1.5341 1.0907 1.0922 1.0812 1.1034 1.0739 1.0818 1.0593 1.0593 1.0570 1.0552 1.0982 1.0984 1.1035 1.1098 1.0587 1.0588 1.1094 1.1094
irintensity: 1.7066 6.2639 5.8907 0.5919 4.2299 0.8418 19.4854 4.0112 0.0190 1.0316 5.5947 0.3235 14.4568 0.1404 15.2630 25.0010 14.3186 24.3315 13.5930 5.6056 67.8209 3.8689 48.3306 49.6509 0.7891 141.7786 2.3166 90.8722 21.8200 0.7510 2.6799 5.8750 11.5821 5.7912 4.4115 0.1342 22.1617 0.8028 3.5181 10.0401 3.7982 0.7261 14.6113 1.5168 30.8291 0.0056 0.0000 7.4611 100.8153 14.7099 5.0751 112.6860 10.7998 65.9513 1.1620 103.0853 47.5896 61.8525 61.1246 5.5282
temp: 298.150 k
press: 1.00000 atm
elementType: 9 9 8 8 6 6 6 6 6 6 1 1 1 1 1 1 1 1 1 1 1 1
symmnumber: 1
zpe: 468436.2 jmol-1
zpe.correction: 0.178418 hartree
zpe.thermalcorrener: 0.190717 hartree
zpe.thermalcorrenthalpy: 0.191661 hartree
zpe.thermalcorrgfe: 0.136689 hartree
zpe.sumelectzpe: -585.078670 hartree
zpe.sumelectthermal: -585.066371 hartree
zpe.sumelectthermalent: -585.065426 hartree
zpe.sumelectthermalfe: -585.120399 hartree
dipole: 0.0000 -4.0118 0.0001
dipole: 4.0118
quadrupole: -60.0349 -62.1992 -57.3101
quadrupole: 0.0004 14.5273 0.0002
quadrupole: -0.1868 -2.3511 2.5379 0.0004 14.5273 0.0002
hfenergy: -585.2570878 hartree
pointgroup: C01 [X(C6H12F2O2)]
dipole: -0.0000059 0.0001564 -1.5783628 debye
dipolederiv: -0.3818748 -0.0642636 -0.0762014 -0.0950494 -0.3581428 -0.1293373 -0.1759488 -0.182961 -0.6324794 -0.3818737 -0.0642783 0.0761875 -0.095084 -0.3582053 0.1293927 0.175929 0.1830163 -0.632418 -1.2234344 0.1048861 0.009862 0.1484712 -0.4240921 -0.0115113 -0.0009239 0.0124975 -0.4179808 -1.2234364 0.1048866 -0.0098384 0.1484692 -0.4240922 0.0115103 0.0009605 -0.012498 -0.4179811 0.7127998 0.0716511 0.0109814 0.216881 0.2598832 0.015017 -0.0129954 0.011674 0.4227397 0.7128007 0.0716544 -0.0109629 0.2168791 0.2598906 -0.0150556 0.0130422 -0.0117122 0.4227345 0.6208935 -0.2535725 -0.0422884 -0.4795394 0.3195667 -0.025822 0.0312016 0.0344382 0.3713913 0.6208948 -0.2535804 0.0422362 -0.479531 0.3195672 0.0258117 -0.0313017 -0.0344503 0.3713895 0.3873506 0.0530561 0.0883004 0.0568857 0.4433421 0.1586724 0.1462983 0.1486858 0.6999226 0.3873496 0.053073 -0.0882881 0.0569138 0.4434026 -0.1587243 -0.1462858 -0.1487374 0.6998619 -0.0317246 -0.0071625 0.0097358 -0.0707386 -0.0470572 -0.1110267 -0.0407151 -0.1364216 -0.1058878 -0.0198024 0.0021831 -0.0176262 -0.0620541 -0.0346309 0.1031748 0.034072 0.1259257 -0.0989847 -0.0317233 -0.007158 -0.0097403 -0.0707465 -0.0471168 0.1110415 0.0406977 0.1364363 -0.1058307 -0.0198039 0.0021774 0.0176243 -0.0620477 -0.0345763 -0.1031588 -0.0340879 -0.12591 -0.0990383 -0.0361493 0.0072844 -0.0332545 0.1158202 -0.046717 -0.1151969 0.0474043 -0.1573535 -0.1253432 -0.0184736 -0.0229215 0.0337244 0.0949058 -0.0523262 0.1021144 -0.0091496 0.1389691 -0.0696057 -0.03615 0.007278 0.0332554 0.1158302 -0.0467719 0.115212 -0.0473812 0.1573695 -0.1252874 -0.0184733 -0.0229148 -0.0337289 0.0949032 -0.0522765 -0.1021105 0.0091693 -0.138965 -0.0696544 -0.1172315 0.0963005 0.0391485 0.1136324 -0.0055958 -0.0816458 -0.0090636 -0.0466105 0.0081311 0.107647 0.0125585 -0.0226485 -0.0392143 -0.0542305 0.0975361 -0.0145263 0.0532317 -0.051903 -0.1172321 0.0963082 -0.0391287 0.1136303 -0.0056206 0.0816427 0.0090865 0.0466075 0.0081567 0.1076474 0.0125541 0.0226505 -0.039217 -0.0542003 -0.0975363 0.014518 -0.0532323 -0.051933 unknown
polarizability: 96.9621492|-2.7740908|63.9902052|-0.0003803|0.0001769|62.6698468 unknown
InChI: InChI=1S/C6H12F2O2/c7-1-3-9-5-6-10-4-2-8/h1-6H2
charge 0 multiplicity 1
22 atoms
F  4.436618 0.412685 1.195215
F  -4.436593 -0.412893 1.195172
O  1.829614 0.1038 -0.311733
O  -1.829595 -0.103702 -0.311732
C  0.521191 -0.558032 -0.283201
C  -0.521173 0.558124 -0.283059
C  2.936537 -0.849195 -0.263358
C  -2.93652 0.849281 -0.263154
C  4.23453 -0.068217 -0.170835
C  -4.234511 0.068282 -0.170783
H  0.385112 -1.207846 -1.174585
H  0.412968 -1.182139 0.628562
H  -0.385108 1.208152 -1.174291
H  -0.412938 1.182013 0.628851
H  2.946489 -1.47371 -1.18686
H  2.841198 -1.526362 0.61307
H  -2.946478 1.473983 -1.18653
H  -2.841177 1.526269 0.613412
H  5.100118 -0.712299 -0.412401
H  4.205806 0.818241 -0.828909
H  -5.100102 0.712409 -0.412218
H  -4.205787 -0.818045 -0.829034
