program: Gaussian 09
title: 000045600
version: EM64L-G09RevD.01
frameworkgroup: C1[X(C17H24N2O)]
method: RPBEPBE
basis: SDD
operation: Freq
keyword: #p
keyword: freq=noraman
keyword: PBEPBE/SDD
title: #p freq=noraman PBEPBE/SDD
converged: YES YES NO NO
title: Mulliken charges:
elementType: O N N C C C C C C C C C C C C C C C C C H H H H H H H H H H H H H H H H H H H H H H H H
charge: -0.287318 -0.239825 -0.457255 -0.047823 -0.473616 -0.468393 -0.517382 -0.460402 -0.554589 0.251277 0.013408 0.147515 0.246620 0.173325 -0.810505 -0.401237 0.160697 -0.371511 -0.863864 -0.537600 0.211835 0.223267 0.221106 0.211265 0.209250 0.211170 0.232694 0.215498 0.221028 0.192151 0.237239 0.250434 0.295240 0.239605 0.230014 0.245373 0.224383 0.234568 0.224131 0.277143 0.222919 0.215333 0.214766 0.238066
chargesum: 0.00000
title: Mulliken charges with hydrogens summed into heavy atoms:
elementType: O N N C C C C C C C C C C C C C C C C C
charge: -0.287318 0.010608 -0.162015 0.164012 -0.029243 -0.047878 -0.073519 -0.023877 -0.125199 0.251277 0.013408 0.147515 0.246620 0.173325 -0.095513 -0.176854 0.160697 -0.136943 -0.139670 0.130565
polarizability: 2.53531168e+02 -2.00048784e+01 2.35463972e+02 1.58647389e+01 6.89913391e+00 1.29353726e+02
1716.lowfreq: -6.0845 -0.0004 0.0004 0.0007 6.4977 7.9518 22.6475 34.5948 43.7616
frequency: 22.3770 34.2920 43.7188 62.0014 65.2385 88.6085 105.4330 107.9250 114.6430 151.7803 156.7306 177.6734 193.3175 222.7749 246.4534 264.5037 268.4816 292.2750 311.1978 341.8668 369.3672 377.7058 395.9299 442.0696 457.5574 478.0824 501.9378 527.9871 571.0091 593.3943 608.1487 621.3755 653.7770 661.7891 695.5568 711.1595 745.0487 756.9401 770.1488 777.7683 791.5013 801.8325 851.7819 896.0878 900.0007 911.7776 932.2354 966.4832 979.1595 988.6124 994.8428 996.5419 1037.4294 1039.7629 1043.7241 1053.5910 1072.1525 1086.7376 1102.3581 1112.5251 1117.0434 1131.5279 1150.9985 1161.0861 1186.7866 1195.0574 1219.3582 1226.5766 1244.6596 1247.7594 1262.6919 1275.5385 1279.6346 1288.9249 1305.5377 1310.5583 1319.6589 1325.0649 1343.9825 1348.5399 1390.5692 1392.8184 1410.1310 1418.9848 1426.1147 1442.4360 1447.0639 1459.9509 1465.4382 1466.1293 1467.4051 1469.1487 1472.5290 1474.4315 1478.4266 1484.0310 1486.8015 1492.8643 1499.1055 1575.0787 1592.8464 1634.2738 2947.9954 2948.5829 2959.8805 2963.7299 2972.7899 2975.2628 2976.3938 2986.7178 3001.7329 3013.9413 3031.0858 3031.1373 3046.6327 3051.7155 3056.2026 3062.6283 3072.7584 3092.3329 3111.6439 3113.2493 3131.8499 3167.2036 3417.6949 3607.0998
redmass: 3.3563 3.0791 3.4365 3.1245 2.2923 1.1152 2.7520 3.1647 2.8319 2.8280 1.2003 2.9597 3.2263 2.1706 2.5936 1.4608 2.5809 2.3771 3.5643 3.0932 3.6219 4.3703 3.6038 2.6887 3.4138 1.1916 3.5095 3.8594 3.4506 4.7322 3.4552 3.2009 4.2341 4.6080 3.0358 1.7332 3.6074 1.6146 4.7223 1.5977 1.9577 1.7489 2.8305 2.2216 1.3416 2.3703 2.5925 1.6890 2.0701 2.6917 2.1769 1.7490 1.5119 1.4851 2.9612 2.1650 2.5517 3.6539 2.3764 1.2682 2.6098 1.7689 1.5704 1.7837 1.8089 1.3068 1.7205 1.5207 1.2299 1.7776 1.3385 1.2928 1.3902 1.3068 1.9438 1.2668 1.4052 3.7806 1.4953 1.5404 1.2713 1.9981 1.9860 1.9188 1.1389 1.3245 2.5112 1.2147 1.1632 1.0535 1.1694 1.0710 1.0876 1.1850 1.1254 1.0899 1.0600 1.4861 1.6925 6.7568 6.2452 7.2182 1.0334 1.0825 1.0599 1.0395 1.0675 1.0592 1.0482 1.0615 1.0640 1.0974 1.1016 1.0996 1.1019 1.0946 1.0947 1.1003 1.1039 1.0949 1.0985 1.0960 1.0890 1.0939 1.0753 1.0803
irintensity: 0.1595 0.5496 1.2470 5.0627 0.1745 0.0649 1.5982 0.6637 1.2567 2.6614 0.6425 4.6434 4.3646 7.6739 3.6250 0.5439 1.7810 0.0131 0.6941 0.4427 0.2522 1.3491 1.6384 2.0882 11.1461 82.6256 0.3769 1.0130 1.5062 2.0549 7.2398 12.1966 6.4430 5.7476 44.6047 149.1483 3.3603 1.4066 7.1650 54.2441 7.3904 6.1476 9.5343 3.5538 0.7970 4.8923 8.7621 1.4328 0.2386 8.2494 14.7447 1.0151 4.1160 4.4721 15.8353 0.6429 48.0006 18.6293 40.1937 0.3252 56.4429 6.0500 12.9503 17.8840 45.9544 2.9054 35.3518 13.1110 3.7702 50.7797 4.3348 0.0926 18.6540 1.2403 14.5041 6.2715 1.7454 28.5299 2.7647 1.0811 19.7849 10.0281 35.6138 59.8878 6.9847 3.1248 8.2364 1.6924 5.2883 5.9989 20.4011 9.4237 4.3036 11.2246 63.1272 3.9353 10.9136 22.4602 42.0802 4.7965 34.8090 4.5431 103.9477 11.1232 3.6236 68.3275 10.7637 47.7427 98.1442 43.2582 54.6386 30.4674 12.9544 65.1871 3.1518 24.0589 25.3980 37.3469 80.4787 17.0378 33.5015 4.4302 10.5415 18.1237 2.4319 47.6613
temp: 298.150 k
press: 1.00000 atm
elementType: 8 7 7 6 6 6 6 6 6 6 6 6 6 6 6 6 6 6 6 6 1 1 1 1 1 1 1 1 1 1 1 1 1 1 1 1 1 1 1 1 1 1 1 1
symmnumber: 1
zpe: 990956.6 jmol-1
zpe.correction: 0.377435 hartree
zpe.thermalcorrener: 0.397926 hartree
zpe.thermalcorrenthalpy: 0.398870 hartree
zpe.thermalcorrgfe: 0.326994 hartree
zpe.sumelectzpe: -845.410592 hartree
zpe.sumelectthermal: -845.390102 hartree
zpe.sumelectthermalent: -845.389157 hartree
zpe.sumelectthermalfe: -845.461034 hartree
dipole: 1.6179 3.2203 -0.6425
dipole: 3.6607
quadrupole: -111.5956 -105.2546 -125.9835
quadrupole: -7.0456 13.3405 3.3715
quadrupole: 2.6823 9.0233 -11.7056 -7.0456 13.3405 3.3715
hfenergy: -845.7880278 hartree
pointgroup: C01 [X(C17H24N2O1)]
dipole: 0.7844226 -1.1901217 0.2062792 debye
polarizability: 247.1908978|21.9381648|240.0335515|-21.4639119|5.275624|131.1244167 unknown
InChI: InChI=1S/C17H24N2O/c1-11-16(20-3)7-6-15-17(11)14(12(2)19-15)5-4-13-8-9-18-10-13/h6-7,13,18-19H,4-5,8-10H2,1-3H3
charge 0 multiplicity 1
44 atoms
O  2.866966 3.00247 -0.115747
N  -5.838191 0.543299 -0.532415
N  1.964198 -2.495977 -0.359664
C  -3.663907 -0.375184 0.083324
C  -3.846565 0.956552 0.882105
C  -2.219252 -0.660614 -0.377363
C  -4.680807 -0.209243 -1.089006
C  -5.236789 1.532398 0.417285
C  -1.227117 -0.913549 0.794104
C  0.178592 -1.249694 0.341692
C  1.294273 -0.345033 0.058574
C  0.629039 -2.550917 0.073906
C  2.397712 -1.165891 -0.377046
C  1.46579 1.071154 0.140431
C  -0.082254 -3.871101 0.176325
C  3.650099 -0.633789 -0.731071
C  2.738126 1.592018 -0.218944
C  3.814796 0.762297 -0.649417
C  0.366335 2.012429 0.596278
C  4.142328 3.598239 -0.498121
H  -4.008483 -1.221294 0.716446
H  -3.033597 1.664946 0.632054
H  -3.811915 0.787615 1.972797
H  -1.854343 0.189045 -0.990577
H  -2.209065 -1.547538 -1.044162
H  -4.216271 0.389358 -1.898898
H  -5.011449 -1.168742 -1.524156
H  -5.927872 1.720367 1.258062
H  -5.088284 2.492601 -0.111259
H  -1.62885 -1.744067 1.410291
H  -1.2179 -0.027809 1.453248
H  -6.47799 -0.095872 -0.037442
H  2.531251 -3.303873 -0.60612
H  -0.265893 -4.321582 -0.819168
H  0.496539 -4.604931 0.770595
H  -1.0617 -3.745772 0.665735
H  4.476572 -1.27338 -1.059781
H  4.779893 1.200618 -0.917965
H  0.152407 1.889696 1.675683
H  0.664637 3.058439 0.431647
H  -0.575455 1.826346 0.049329
H  4.387215 3.396841 -1.560394
H  4.971357 3.237525 0.143408
H  4.009924 4.681102 -0.350801
