program: Gaussian 09
title: 000045552
version: EM64L-G09RevD.01
frameworkgroup: C1[X(C18H24ClN)]
method: RPBEPBE
basis: SDD
operation: Freq
keyword: #p
keyword: freq=noraman
keyword: PBEPBE/SDD
title: #p freq=noraman PBEPBE/SDD
converged: YES YES NO NO
title: Mulliken charges:
elementType: Cl N C C C C C C C C C C C C C C C C C C H H H H H H H H H H H H H H H H H H H H H H H H
charge: -0.071760 -0.126469 -0.134522 0.221788 0.209176 -0.532095 -0.516496 -0.519960 -0.400532 -0.425532 -0.466820 -0.410180 -0.573187 -0.639728 0.534439 -0.405366 -0.406631 -0.215893 -0.216828 -0.105312 0.189710 0.206727 0.219502 0.226895 0.202162 0.210754 0.218018 0.210345 0.185997 0.203438 0.201024 0.226129 0.219754 0.206028 0.200545 0.239020 0.217060 0.191631 0.225657 0.224630 0.240759 0.235016 0.250592 0.250518
chargesum: 0.00000
title: Mulliken charges with hydrogens summed into heavy atoms:
elementType: Cl N C C C C C C C C C C C C C C C C C C
charge: -0.071760 -0.126469 0.055188 0.221788 0.209176 -0.105867 -0.087439 -0.091188 -0.004191 -0.021069 -0.020937 -0.003608 -0.117108 0.002189 0.534439 -0.164607 -0.171615 0.034699 0.033690 -0.105312
polarizability: 2.69602294e+02 -1.32143524e+00 2.01979918e+02 1.63832428e+01 -7.48272872e+00 1.46795103e+02
1716.lowfreq: -13.8468 -4.9714 -0.0015 -0.0014 -0.0009 3.4361 8.9765 19.5942 22.8944
frequency: 4.2309 17.8176 22.7144 51.0047 56.1217 89.4573 123.8656 129.5909 160.7008 192.5532 214.4615 235.4627 255.6380 268.9798 298.5373 330.4596 334.3859 356.7041 365.6631 374.6995 380.2633 408.3418 423.9188 435.7905 456.2055 496.9025 518.5395 528.9525 607.2644 627.5324 643.9782 654.3157 716.9787 729.4788 750.6586 794.6142 810.7723 826.3379 829.7986 839.9768 852.3147 866.5076 876.0396 903.1011 940.1200 952.6531 964.6762 979.6198 991.5269 999.6074 1013.3373 1022.9012 1054.5050 1063.0054 1071.1733 1081.0657 1083.4840 1101.8807 1105.7755 1106.5527 1126.3082 1130.3563 1147.8655 1168.6237 1173.7937 1181.6386 1189.5564 1205.7771 1208.0038 1216.0754 1240.8979 1245.0110 1266.0401 1269.0360 1287.8232 1295.3721 1297.2669 1324.9048 1330.7788 1333.0544 1339.1516 1344.3014 1349.1060 1371.1522 1372.9251 1374.6641 1394.3237 1431.2880 1448.1965 1452.5752 1458.0717 1463.6699 1468.9751 1474.5882 1475.6976 1476.2745 1479.3214 1482.3049 1493.8775 1585.9159 1599.4451 1701.4297 2780.4019 2840.9385 2857.2799 2934.2483 2938.6487 2962.1604 2971.5720 2973.9935 2989.2789 2990.5048 2991.8225 3000.8186 3010.5852 3019.7402 3027.2340 3036.6990 3036.9923 3044.6926 3060.9897 3083.8276 3123.7479 3127.3128 3164.5173 3167.8189
redmass: 3.7531 4.7987 3.5400 5.0004 4.3448 3.3286 2.7612 2.6546 5.2265 1.3083 1.8982 3.9934 2.4075 2.8411 1.7882 2.5250 4.0027 2.4871 3.9432 2.7154 5.8019 2.8987 3.0498 2.8750 2.8928 3.3913 2.9974 2.5159 4.6026 6.9106 2.6962 3.4459 3.5939 2.5865 2.4732 1.4415 2.0088 1.5094 1.3004 2.5455 2.0384 2.3851 2.2648 1.4879 1.9412 1.7316 1.3693 1.8623 2.1334 4.3149 1.7974 2.1310 2.0011 2.4872 2.6604 1.9046 1.6934 2.1167 1.9183 1.3005 1.2932 1.3544 1.5770 1.6893 1.8353 1.1217 1.5647 1.5408 1.6864 2.4027 1.9016 1.3701 1.2115 1.2085 1.4633 1.4057 1.3051 1.4196 1.4078 1.5234 1.4600 1.4699 1.5548 1.8976 1.8201 5.1438 2.7550 1.1865 1.0920 1.0922 1.0808 1.0642 1.0887 1.1007 1.7438 1.0814 1.2720 1.0945 1.0873 7.3543 6.3419 7.5183 1.0792 1.0687 1.0596 1.0630 1.0625 1.0602 1.0711 1.0716 1.0600 1.0845 1.0870 1.0601 1.0982 1.0896 1.0722 1.0983 1.0984 1.1041 1.1035 1.0994 1.0896 1.0896 1.0950 1.0960
irintensity: 0.0163 0.1112 0.1091 0.1066 0.0806 0.4067 0.1760 0.0145 0.1872 0.0684 0.8565 0.3398 5.3538 3.3934 1.3471 2.4286 3.1985 0.1772 0.2787 0.1567 19.2720 0.0062 1.1401 0.1131 0.5882 10.1687 13.6937 5.6058 3.5002 0.1039 0.8145 9.0457 6.1703 1.0614 8.9861 6.5659 36.2119 4.2366 1.3982 27.6605 3.3076 9.1101 5.1342 1.8023 1.2012 0.9454 0.0339 6.8942 1.4211 37.6869 3.0600 8.7166 4.1181 10.4032 41.0104 3.8430 7.9408 17.6315 3.3312 0.8510 2.0463 7.0111 0.3957 8.4685 2.2663 0.4186 4.8246 14.9377 7.3830 1.8864 32.6734 5.6273 4.4281 1.3568 9.2685 1.9284 5.1138 13.1360 1.0335 7.9443 2.0004 5.0183 0.8913 9.1384 3.8446 0.9602 4.4598 5.6155 6.0181 0.3384 14.3398 9.7215 9.2224 6.9562 51.5655 14.7540 35.2303 20.1274 20.4780 0.9402 0.7140 0.3465 71.8684 62.8333 218.0867 59.2697 37.2859 49.4090 16.4902 16.9687 2.8232 89.5880 18.3408 53.5618 45.8281 48.3443 45.5175 52.4503 21.4487 73.8813 40.8182 34.8179 14.1170 13.4187 9.4315 0.6921
temp: 298.150 k
press: 1.00000 atm
elementType: 17 7 6 6 6 6 6 6 6 6 6 6 6 6 6 6 6 6 6 6 1 1 1 1 1 1 1 1 1 1 1 1 1 1 1 1 1 1 1 1 1 1 1 1
symmnumber: 1
zpe: 988144.0 jmol-1
zpe.correction: 0.376364 hartree
zpe.thermalcorrener: 0.395647 hartree
zpe.thermalcorrenthalpy: 0.396591 hartree
zpe.thermalcorrgfe: 0.324537 hartree
zpe.sumelectzpe: -1213.600128 hartree
zpe.sumelectthermal: -1213.580845 hartree
zpe.sumelectthermalent: -1213.579901 hartree
zpe.sumelectthermalfe: -1213.651955 hartree
dipole: -3.9889 0.4286 0.4455
dipole: 4.0365
quadrupole: -143.1574 -117.8028 -129.4070
quadrupole: 1.9215 1.2524 -0.9457
quadrupole: -13.0350 12.3196 0.7154 1.9215 1.2524 -0.9457
hfenergy: -1213.9764921 hartree
pointgroup: C01 [X(C18H24Cl1N1)]
dipole: -1.5710633 -0.153001 -0.1743305 debye
polarizability: 269.6269264|0.4718536|201.8487158|-16.451959|-7.7109822|146.9016734 unknown
InChI: InChI=1S/C18H24ClN/c1-20-13-12-15-4-2-3-5-17(15)18(20)11-8-14-6-9-16(19)10-7-14/h6-7,9-10,18H,2-5,8,11-13H2,1H3
charge 0 multiplicity 1
44 atoms
Cl 6.797289 0.3855 0.021781
N  -1.687807 -2.118238 -0.130581
C  -1.46821 -0.891609 -0.952716
C  -2.264108 0.323315 -0.465257
C  -3.089898 0.282468 0.61957
C  -2.076774 1.595957 -1.286992
C  -3.33624 -1.023506 1.354203
C  -3.841487 1.501259 1.138864
C  -3.051576 -2.221348 0.438187
C  -3.176459 2.646702 -1.017345
C  0.058828 -0.565424 -1.014068
C  -3.37424 2.829258 0.502924
C  0.659277 -0.214162 0.372906
C  -1.30954 -3.353435 -0.846746
C  2.168836 -0.055636 0.3191
C  3.023763 -1.174759 0.50016
C  2.767121 1.202742 0.048418
C  4.428837 -1.053168 0.411242
C  4.169961 1.349726 -0.045014
C  4.979704 0.212865 0.136881
H  -1.790703 -1.084093 -2.014382
H  -1.084462 2.048214 -1.070074
H  -2.055394 1.335907 -2.365876
H  -2.696977 -1.08712 2.258531
H  -4.38828 -1.063769 1.703947
H  -4.928458 1.356441 0.953196
H  -3.735637 1.546763 2.243063
H  -3.111299 -3.167769 1.008511
H  -3.834975 -2.264556 -0.362914
H  -2.907352 3.607562 -1.496143
H  -4.130703 2.311506 -1.471112
H  0.226281 0.26742 -1.723233
H  0.602597 -1.433109 -1.432983
H  -4.107352 3.63134 0.712194
H  -2.412648 3.142108 0.957573
H  0.370533 -1.024162 1.067976
H  0.187519 0.715381 0.744986
H  -1.937541 -3.541495 -1.754941
H  -1.420115 -4.219249 -0.169601
H  -0.255149 -3.313955 -1.168887
H  2.586509 -2.155972 0.721556
H  2.129963 2.085306 -0.086981
H  5.07948 -1.920437 0.557044
H  4.621688 2.324834 -0.250368
