program: Gaussian 09
title: 000042657
version: EM64L-G09RevD.01
frameworkgroup: C1[X(C18H26N2O2)]
method: RPBEPBE
basis: SDD
operation: Freq
keyword: #p
keyword: freq=noraman
keyword: PBEPBE/SDD
title: #p freq=noraman PBEPBE/SDD
converged: YES YES NO NO
title: Mulliken charges:
elementType: O O N N C C C C C C C C C C C C C C C C C C H H H H H H H H H H H H H H H H H H H H H H H H H H
charge: -0.276076 -0.268445 -0.049383 -0.410625 -0.165930 -0.049467 -0.027233 -0.443048 -0.462135 -0.441393 -0.427406 -0.422277 -0.386492 -0.616888 0.157987 0.126223 0.184138 -0.356506 -0.365073 -0.263337 -0.207059 -0.532933 0.190385 0.194716 0.287612 0.196939 0.193795 0.197685 0.223199 0.185656 0.207990 0.180422 0.232765 0.201993 0.214735 0.215225 0.170413 0.302198 0.184152 0.225785 0.226130 0.240763 0.252600 0.229116 0.230230 0.282377 0.210058 0.226421
chargesum: 0.00000
title: Mulliken charges with hydrogens summed into heavy atoms:
elementType: O O N N C C C C C C C C C C C C C C C C C C
charge: -0.276076 -0.268445 -0.049383 -0.108426 0.024455 0.145249 0.260378 -0.052315 -0.041250 -0.047747 -0.014219 -0.005550 -0.000854 0.019178 0.157987 0.126223 0.184138 -0.115743 -0.112473 -0.034221 0.023171 0.185923
polarizability: 2.58146427e+02 -1.20024662e+01 2.23725772e+02 2.72892149e+00 -1.66624395e+01 1.52611479e+02
1716.lowfreq: -18.6155 -6.2009 -0.0010 -0.0006 -0.0004 4.6056 13.0786 26.0229 44.6878
frequency: 11.0848 25.2058 44.5536 51.4873 73.8726 98.6443 104.2925 138.4014 167.5454 171.6705 184.8522 208.8128 219.5550 225.2599 247.4264 258.5215 285.5792 297.4445 318.0282 338.1216 355.7999 373.6629 379.4483 394.1318 416.6914 439.8529 470.4192 474.2355 506.2811 530.5789 538.1028 563.1205 574.1465 625.9296 640.6637 656.3515 703.5298 734.3975 753.1600 760.3731 766.7246 794.1881 827.1713 833.4305 862.5400 865.7658 868.8653 900.6481 918.1682 943.3031 948.7274 978.6503 981.0458 996.3334 1014.0326 1015.8059 1033.8530 1041.5237 1057.0209 1061.0084 1081.3277 1085.8069 1098.7373 1103.7380 1116.8121 1117.6880 1132.5264 1140.3258 1144.3947 1152.4695 1160.0091 1167.9622 1186.5386 1198.0251 1211.7060 1225.6830 1230.8231 1255.9395 1265.6831 1268.6174 1274.8992 1292.1934 1296.3849 1298.2046 1314.3860 1321.7556 1339.5444 1341.2719 1345.5705 1351.8790 1360.0684 1370.4388 1376.0045 1380.0306 1414.3879 1433.0718 1441.1388 1452.7979 1455.1782 1459.1475 1461.1339 1464.2911 1466.9912 1468.8511 1474.6568 1475.0292 1477.2429 1478.0357 1480.5380 1567.1548 1585.8153 1611.1090 2802.8016 2812.3429 2853.2672 2925.6542 2944.3129 2960.2300 2966.5794 2972.2849 2984.7315 2989.4830 3015.3757 3018.7950 3021.3046 3025.6780 3034.0648 3040.3499 3050.5458 3057.2765 3077.3729 3081.7537 3122.6741 3123.1793 3137.4648 3158.4893 3172.8415 3524.7346
redmass: 4.5247 4.4503 3.8744 5.1601 3.2280 3.5876 3.9943 2.5831 3.7286 4.4732 4.0548 1.6071 2.0525 1.6464 2.5766 2.5733 2.0668 3.0159 2.2001 3.1283 2.3746 2.2763 3.0948 2.6751 2.9819 4.4133 3.1664 3.9326 2.9664 2.7359 3.3163 1.3330 4.4891 3.3658 3.1721 3.5049 5.1957 4.1904 3.7266 2.9831 1.6739 2.2903 2.7782 1.9734 2.3703 1.5811 2.1629 1.7500 1.9810 2.1814 1.3978 6.3478 1.3816 1.8963 1.7132 2.2447 2.8621 2.1852 2.5348 1.5390 1.5382 1.5567 2.1851 1.4314 1.6594 1.6209 2.0279 2.0371 2.3921 1.4239 1.3379 1.0680 1.9110 1.4545 1.5908 3.0601 1.6445 1.4575 1.6466 1.6239 1.3524 1.5231 1.4235 1.5893 1.3492 1.3955 1.5637 1.4014 1.3593 1.4527 1.5032 1.5148 1.4830 4.7931 1.8670 1.1660 1.5399 1.1188 1.0825 1.1964 1.1517 1.0704 1.2858 1.1320 1.6707 1.1680 1.0946 1.2106 1.0577 6.1810 6.9955 6.4623 1.0719 1.0693 1.0576 1.0819 1.0784 1.0648 1.0667 1.0342 1.0626 1.0631 1.0853 1.0722 1.0979 1.0876 1.0889 1.0981 1.0971 1.0984 1.1009 1.0978 1.1048 1.0872 1.0888 1.0945 1.0994 1.0773
irintensity: 0.7218 0.1086 0.1682 1.0047 0.9136 7.5060 2.4850 1.7081 2.1149 1.5983 4.3731 0.6064 2.6247 0.3342 1.6865 2.1083 4.6681 3.4209 0.7886 2.1201 8.8830 1.2292 4.9550 0.6904 0.0316 2.6881 2.9286 2.5869 4.8148 6.0995 51.2290 49.6582 5.5766 15.0112 1.6761 1.5934 8.8143 2.2051 9.8330 48.9278 45.5413 0.1916 4.9591 5.2607 2.0286 3.0567 12.0377 4.3305 2.7673 3.1672 2.9666 28.9668 2.1807 7.4933 0.6534 5.7647 11.6586 14.3671 4.2189 1.7814 7.7228 13.9325 26.0777 4.9189 2.7163 4.0329 0.8569 29.6881 5.3105 3.2231 2.4420 2.2793 7.2632 7.1138 15.8980 95.6156 42.0394 14.5060 14.7781 50.9830 17.0633 35.3498 14.2072 3.6487 29.8340 10.6611 0.4826 0.9939 1.9797 0.3785 12.6492 10.6017 3.9310 17.5038 21.5348 3.9369 6.6896 82.1601 8.1355 67.9130 9.8683 44.4244 89.6896 32.3280 89.6987 84.1634 0.5200 52.9109 7.3750 33.5093 123.9927 62.0673 41.9761 130.8115 210.3232 36.8270 30.2753 30.1986 87.5978 55.1374 12.2632 46.2288 56.2675 40.7195 62.3488 46.1646 33.0427 34.6404 22.7805 62.2161 36.7935 36.6611 17.3614 8.1248 12.5939 19.8901 17.1529 15.3092
temp: 298.150 k
press: 1.00000 atm
elementType: 8 8 7 7 6 6 6 6 6 6 6 6 6 6 6 6 6 6 6 6 6 6 1 1 1 1 1 1 1 1 1 1 1 1 1 1 1 1 1 1 1 1 1 1 1 1 1 1
symmnumber: 1
zpe: 1080333.4 jmol-1
zpe.correction: 0.411477 hartree
zpe.thermalcorrener: 0.432516 hartree
zpe.thermalcorrenthalpy: 0.433460 hartree
zpe.thermalcorrgfe: 0.360381 hartree
zpe.sumelectzpe: -959.774590 hartree
zpe.sumelectthermal: -959.753551 hartree
zpe.sumelectthermalent: -959.752607 hartree
zpe.sumelectthermalfe: -959.825686 hartree
dipole: 2.9537 0.5547 -3.8791
dipole: 4.9071
quadrupole: -128.0606 -121.9884 -138.4488
quadrupole: -1.5117 5.5449 -0.2685
quadrupole: 1.4387 7.5108 -8.9495 -1.5117 5.5449 -0.2685
hfenergy: -960.1860668 hartree
pointgroup: C01 [X(C18H26N2O2)]
dipole: -1.1744453 -0.2059506 -1.518384 debye
polarizability: 257.9073847|-12.1579335|223.8613013|-3.3516466|16.9008976|152.714992 unknown
InChI: InChI=1S/C18H26N2O2/c1-20-11-10-13-6-5-8-16(15(13)12-20)19-18(21)14-7-3-4-9-17(14)22-2/h3-4,7,9,13,15-16,19H,5-6,8,10-12H2,1-2H3
charge 0 multiplicity 1
48 atoms
O  1.064625 0.796738 1.6306
O  4.101012 1.613595 0.538007
N  -2.760407 -1.8418 0.632769
N  0.169876 0.265582 -0.450889
C  -2.2393 -0.008161 -0.990935
C  -3.679142 0.562247 -0.791322
C  -1.190737 0.75478 -0.136229
C  -3.720752 2.097326 -1.003175
C  -4.256842 0.135961 0.583621
C  -2.237323 -1.531467 -0.714668
C  -1.266997 2.287532 -0.367717
C  -2.688501 2.838883 -0.122068
C  -4.160903 -1.388654 0.784583
C  -2.573045 -3.257585 0.99824
C  1.214159 0.321645 0.457855
C  2.508705 -0.280395 -0.036951
C  3.798378 0.320577 0.105238
C  2.444708 -1.60421 -0.565701
C  4.961794 -0.419909 -0.243308
C  3.596459 -2.329042 -0.920392
C  4.867546 -1.727637 -0.745865
C  3.082779 2.670369 0.626133
H  -1.969157 0.140091 -2.062247
H  -4.318087 0.088532 -1.568893
H  -1.357385 0.53676 0.934073
H  -4.743415 2.471424 -0.797335
H  -3.505238 2.322224 -2.068617
H  -5.316768 0.451698 0.649603
H  -3.713593 0.632786 1.407913
H  -2.844708 -2.038326 -1.513936
H  -1.206928 -1.928946 -0.783906
H  -0.96423 2.504508 -1.414235
H  -0.534555 2.780564 0.298029
H  -2.714435 3.92362 -0.34089
H  -2.948751 2.728348 0.94881
H  -4.509726 -1.662633 1.797987
H  -4.836539 -1.90461 0.048259
H  0.378858 -0.006525 -1.414633
H  -3.127795 -3.966646 0.331119
H  -2.920019 -3.422811 2.03391
H  -1.499531 -3.515312 0.954049
H  1.460856 -2.081877 -0.646609
H  5.929121 0.076424 -0.119173
H  3.509845 -3.349712 -1.30651
H  5.780199 -2.274661 -1.006634
H  2.454788 2.533808 1.520887
H  2.441438 2.678748 -0.276888
H  3.660961 3.605653 0.680841
