program: Gaussian 09
title: 000045618
version: EM64L-G09RevD.01
frameworkgroup: C1[X(C19H22Cl2N2O2)]
method: RPBEPBE
basis: SDD
operation: Freq
keyword: #p
keyword: freq=noraman
keyword: PBEPBE/SDD
title: #p freq=noraman PBEPBE/SDD
converged: NO YES NO NO
title: Mulliken charges:
elementType: Cl Cl O O N N C C C C C C C C C C C C C C C C C C C H H H H H H H H H H H H H H H H H H H H H H
charge: -0.051115 -0.062526 -0.248494 -0.294382 -0.069206 -0.294360 -0.354771 -0.365660 -0.307487 -0.306920 -0.374040 -0.283382 -0.241514 0.511071 0.384624 -0.447893 -0.376992 -0.343027 -0.414594 -0.203033 -0.211478 -0.206574 -0.199020 -0.119738 -0.115716 0.188388 0.236180 0.219033 0.187614 0.217146 0.198397 0.197650 0.216380 0.230157 0.245472 0.192618 0.209519 0.169059 0.230235 0.240536 0.247730 0.261291 0.285556 0.256849 0.255276 0.257108 0.254036
chargesum: 0.00000
title: Mulliken charges with hydrogens summed into heavy atoms:
elementType: Cl Cl O O N N C C C C C C C C C C C C C C C C C C C
charge: -0.051115 -0.062526 -0.248494 -0.294382 -0.069206 -0.064203 0.069797 0.040988 0.108056 0.107110 0.064049 -0.073863 0.157779 0.511071 0.384624 -0.207358 -0.129262 -0.081736 -0.129039 0.053816 0.043798 0.050534 0.055016 -0.119738 -0.115716
polarizability: 2.63511561e+02 1.18857250e+01 2.96053521e+02 2.98511622e+00 1.27354185e+01 1.78179971e+02
1716.lowfreq: -14.0529 -4.7997 -0.0027 -0.0027 -0.0023 2.4132 6.3504 15.8323 17.3137
frequency: -11.3142 15.7247 17.1797 23.6202 28.7850 33.9454 44.3898 74.5871 88.7990 98.7758 118.3458 128.4432 158.7193 177.8605 183.7356 218.0745 241.6209 250.1046 274.3284 301.5624 305.8760 325.8954 337.9870 347.1568 384.7433 406.1742 408.3526 415.6613 427.3752 442.8353 466.6683 482.8985 495.9762 510.8122 564.4495 610.3401 622.4729 626.1758 662.5032 675.5463 703.3008 719.1190 726.7588 784.9327 792.5469 807.1232 821.6991 830.9122 832.2675 835.5067 838.9037 848.7149 877.2909 896.4603 933.2143 954.1793 961.9683 968.6691 981.5278 987.4420 999.9804 1001.0467 1015.4224 1034.8884 1045.9511 1053.8110 1070.5096 1072.4748 1077.9584 1086.4491 1091.6381 1105.8549 1108.3793 1128.4697 1138.3776 1154.0343 1177.3155 1181.2231 1183.0302 1186.0551 1197.3394 1210.1017 1246.9019 1258.4421 1266.2652 1266.9972 1282.1972 1284.1773 1295.9277 1304.8741 1324.4655 1327.6945 1342.8508 1352.5445 1367.8030 1372.4072 1381.3296 1389.4925 1392.0898 1399.8837 1444.5095 1445.2726 1452.4441 1456.4648 1474.8399 1475.6963 1478.6863 1483.6433 1495.2479 1586.0681 1588.5715 1597.3082 1601.6103 2867.7900 2888.0763 2900.8932 2912.0391 2919.3276 2958.9375 2963.2234 3022.2867 3038.2645 3068.4963 3080.3271 3083.7271 3088.0241 3123.5588 3134.2206 3144.6320 3160.0696 3169.3653 3170.8408 3172.3919 3183.9688 3247.8145
redmass: 5.0450 3.8344 3.6445 6.5149 6.7079 5.1134 5.4694 5.6323 2.2540 3.9018 5.9563 5.8425 6.5713 4.3039 7.4620 7.0508 2.0338 3.7547 5.7231 5.9085 5.2642 5.1320 2.9345 4.6472 2.5796 2.8532 2.9171 3.1828 6.6780 5.0624 2.9465 3.3577 5.1208 3.6021 3.8869 2.2553 6.8507 6.8118 6.0794 4.5268 2.1772 4.1424 3.6851 2.4994 2.2190 2.4066 1.8054 1.2716 1.2792 1.3125 1.5519 2.0896 2.7463 2.2469 4.4949 1.4503 1.4177 1.3793 1.3560 2.5344 4.3389 4.1354 2.1951 7.5949 2.1471 2.1681 2.8138 2.6954 3.5652 3.1003 2.7000 1.3654 1.3582 2.8426 1.7850 3.1819 1.5321 1.1359 1.0715 1.7152 1.3092 1.9081 1.3645 1.1323 1.6302 1.4283 1.2179 1.2789 1.2708 1.3649 1.3175 1.2962 1.2545 1.3397 1.2608 5.1452 5.4964 3.6348 1.6504 2.1417 1.0900 1.0913 1.0920 1.1075 2.3869 2.4242 1.1744 1.0898 1.0830 7.7089 7.4661 6.2233 6.2737 1.0698 1.0699 1.0818 1.0706 1.0653 1.0665 1.0665 1.0940 1.0903 1.0905 1.0914 1.0966 1.0980 1.0899 1.0895 1.0893 1.0897 1.0950 1.0954 1.0964 1.0955 1.0730
irintensity: 0.1646 0.0115 0.2340 0.1998 0.4064 0.0762 0.2183 0.4883 0.4990 1.5669 0.3751 0.3982 1.5501 7.1111 4.4730 1.6094 1.3737 8.3072 5.4738 2.9639 2.0517 1.4924 3.9448 4.8639 1.4392 0.0673 0.0187 5.6095 13.1695 0.5832 4.6473 24.5413 7.7800 43.1421 23.1663 9.0532 0.9781 0.8670 7.0171 10.5682 32.2125 5.3862 0.7141 20.3537 72.2209 51.8711 68.4948 9.9097 0.6667 2.2373 0.3352 16.8635 23.6302 2.4904 9.5104 2.6060 1.5526 0.3463 0.2820 36.2702 65.8574 45.7750 7.5873 180.4985 5.4632 34.5757 44.8010 29.0023 39.2087 10.4472 21.0063 6.1909 14.0763 9.6836 5.7147 2.3805 8.5712 3.1212 2.4501 7.0921 4.5596 3.1435 19.4903 3.1593 11.5610 14.1941 5.4909 26.9990 7.1680 1.7358 3.8479 0.4282 8.0232 1.5201 1.2506 4.8570 0.8298 6.7703 5.4565 6.7256 4.1248 3.5397 17.2515 1.9071 42.7231 118.1291 4.6786 1.3623 9.8763 4.2939 3.0441 22.7211 5.7523 60.2916 93.9096 31.7069 69.1226 53.2215 35.7478 96.5947 34.2206 39.0639 23.7228 18.0336 37.5345 34.6260 9.5359 8.0404 2.7959 1.6960 5.3317 4.0442 0.5489 2.3346 31.6712
temp: 298.150 k
press: 1.00000 atm
elementType: 17 17 8 8 7 7 6 6 6 6 6 6 6 6 6 6 6 6 6 6 6 6 6 6 6 1 1 1 1 1 1 1 1 1 1 1 1 1 1 1 1 1 1 1 1 1 1
symmnumber: 1
zpe: 981872.9 jmol-1
zpe.correction: 0.373976 hartree
zpe.thermalcorrener: 0.397242 hartree
zpe.thermalcorrenthalpy: 0.398186 hartree
zpe.thermalcorrgfe: 0.316355 hartree
zpe.sumelectzpe: -1915.358697 hartree
zpe.sumelectthermal: -1915.335431 hartree
zpe.sumelectthermalent: -1915.334487 hartree
zpe.sumelectthermalfe: -1915.416318 hartree
dipole: 1.1449 0.1446 2.3160
dipole: 2.5876
quadrupole: -190.2015 -172.7324 -152.6217
quadrupole: -6.9240 -1.9124 3.1790
quadrupole: -18.3496 -0.8806 19.2302 -6.9240 -1.9124 3.1790
hfenergy: -1915.7326729 hartree
pointgroup: C01 [X(C19H22Cl2N2O2)]
dipole: -0.4516312 -0.2297709 0.8829617 debye
polarizability: 263.5037166|12.2091772|296.5448487|-0.5447032|10.2727196|177.6964875 unknown
InChI: InChI=1S/C19H22Cl2N2O2/c20-17-5-1-15(2-6-17)19(16-3-7-18(21)8-4-16)25-12-9-22-23-10-13-24-14-11-23/h1-8,19,22H,9-14H2
charge 0 multiplicity 1
47 atoms
Cl 2.592279 -5.460831 -1.832287
Cl 5.964484 4.148938 0.153299
O  -7.446015 1.142723 -0.229796
O  0.208084 0.578219 0.30501
N  -4.631481 0.4769 -0.034018
N  -3.442272 -0.04124 0.61104
C  -5.664404 -0.588091 -0.123918
C  -5.185169 1.689425 0.638691
C  -6.882253 -0.046971 -0.89341
C  -6.417428 2.189381 -0.13817
C  -2.198509 0.630954 0.170786
C  1.454825 -0.012429 0.826297
C  -0.995607 -0.187196 0.66011
C  1.751072 -1.36457 0.175132
C  2.565505 1.021107 0.615849
C  1.812746 -2.545078 0.951557
C  3.916232 0.656787 0.844985
C  1.942193 -1.452403 -1.227424
C  2.266465 2.352722 0.241676
C  2.071566 -3.799869 0.351737
C  4.955957 1.601992 0.710031
C  2.195014 -2.694016 -1.845897
C  3.29672 3.3098 0.094072
C  2.258815 -3.85115 -1.041549
C  4.626408 2.918831 0.334949
H  -5.991941 -0.926468 0.889895
H  -5.221358 -1.450209 -0.650647
H  -4.410221 2.477898 0.653267
H  -5.480654 1.462043 1.694537
H  -7.697697 -0.788079 -0.917251
H  -6.581185 0.211448 -1.931229
H  -6.106133 2.503185 -1.157778
H  -6.897821 3.035712 0.379544
H  -3.537525 -0.040942 1.648304
H  -2.2115 0.657607 -0.930871
H  -2.088558 1.679393 0.533702
H  1.330734 -0.179759 1.922948
H  -1.033997 -0.329452 1.765372
H  -0.990161 -1.185413 0.181405
H  1.657855 -2.494713 2.036523
H  4.166463 -0.373941 1.121158
H  1.887954 -0.542481 -1.834765
H  1.225356 2.63068 0.061225
H  2.121536 -4.712333 0.952643
H  5.997419 1.319359 0.887762
H  2.341968 -2.764069 -2.92759
H  3.066343 4.337997 -0.200007
