program: Gaussian 09
title: 000042585
version: EM64L-G09RevD.01
frameworkgroup: C1[X(C11H11N5O4)]
method: RPBEPBE
basis: SDD
operation: Freq
keyword: #p
keyword: freq=noraman
keyword: PBEPBE/SDD
title: #p freq=noraman PBEPBE/SDD
converged: YES YES NO NO
title: Mulliken charges:
elementType: O O O O N N N N N C C C C C C C C C C C H H H H H H H H H H H
charge: -0.263086 -0.206061 -0.248785 -0.249496 -0.167436 -0.202808 -0.038951 -0.057006 0.042338 -0.114132 -0.445265 -0.432666 0.156291 0.179200 0.332481 -0.148758 -0.362955 -0.341531 0.340062 -0.749115 0.297703 0.250172 0.242678 0.267435 0.297791 0.296982 0.293134 0.263661 0.260543 0.253113 0.254466
chargesum: 0.00000
title: Mulliken charges with hydrogens summed into heavy atoms:
elementType: O O O O N N N N N C C C C C C C C C C C
charge: -0.263086 -0.206061 -0.248785 -0.249496 -0.167436 -0.202808 -0.038951 -0.057006 0.042338 0.183571 0.047585 0.132559 0.156291 0.179200 0.332481 0.148224 -0.069821 -0.077870 0.340062 0.019007
polarizability: 2.77732921e+02 -3.65706611e+01 1.89567143e+02 1.15443699e+01 8.33535340e+00 9.74797626e+01
1716.lowfreq: 0.0005 0.0005 0.0009 1.3313 5.5743 10.0564 27.7766 34.2446 44.1655
frequency: 27.3733 34.1629 44.0635 55.7614 68.1786 73.3843 117.2732 150.1261 176.0117 181.5708 200.4874 255.7260 275.9345 298.7766 308.3024 339.2527 367.1317 392.6666 426.5854 464.0793 493.0988 551.3581 570.3855 581.8707 600.1339 619.7710 639.9505 649.5628 676.6917 681.6748 713.8793 726.9019 754.2689 786.3177 833.9503 870.6917 876.2597 881.5730 883.8734 902.3238 930.7778 972.8614 989.8064 1036.0713 1043.9916 1059.1323 1087.5432 1100.7687 1122.2253 1147.0808 1177.0774 1182.0246 1191.3019 1211.6741 1223.5403 1244.5181 1268.7771 1308.3289 1310.5412 1318.3008 1324.2376 1343.0313 1368.7286 1378.9932 1388.0142 1389.9412 1395.9961 1407.1147 1445.4505 1450.7970 1453.2051 1463.2822 1475.9788 1497.4213 1554.4831 1660.1278 3008.5649 3020.4552 3029.2118 3060.2469 3083.9234 3099.5468 3111.2149 3146.1208 3228.1431 3250.7927 3252.9394
redmass: 5.6386 1.2998 3.7173 7.6458 9.0875 3.7055 4.7549 6.2496 5.7727 5.2046 8.9346 5.2867 6.5439 3.0257 6.2647 5.3488 4.2681 3.8811 5.0768 5.3791 5.5012 3.4166 3.6248 4.7358 5.1556 3.8665 4.2910 3.9850 8.0135 8.1022 5.7395 10.3106 10.5892 1.2394 3.7970 4.0766 1.6616 1.4053 6.0266 4.4803 2.8507 2.8605 2.0851 2.3618 1.6620 2.7181 1.6614 3.1116 2.5920 2.2199 2.9020 2.9689 3.1001 1.8306 2.0339 2.5103 3.1304 2.6189 1.5129 5.2141 6.2819 2.8878 1.8398 2.4870 1.3527 1.7219 1.9252 2.4249 1.0946 1.0567 1.0528 4.2012 3.2881 1.1944 7.7975 9.6556 1.0383 1.0639 1.0641 1.0862 1.1011 1.0951 1.0988 1.1018 1.0917 1.0994 1.1090
irintensity: 0.9286 1.6810 1.9780 0.2597 2.7953 1.4946 2.4528 5.3813 1.6347 2.6106 10.2436 1.2838 5.5719 7.8188 0.6399 1.9035 2.7742 4.9254 4.5611 3.1831 10.5680 3.4308 5.4203 1.4476 3.9730 0.8055 0.8937 2.0089 14.3100 10.4600 14.6205 2.7099 11.0374 62.5967 18.7511 199.9529 27.5369 20.4565 5.2769 52.7662 8.1560 121.1766 37.9333 36.6498 8.0182 15.3782 41.1708 38.7586 32.3349 20.1104 504.0025 110.2955 57.4800 95.8730 8.3748 132.7081 94.9870 66.1523 4.1259 155.0656 79.1180 29.6315 22.3026 57.8021 41.3744 22.4165 9.7157 9.2069 13.2296 17.9299 21.5174 177.8102 57.3427 8.2594 50.7111 152.2561 0.2441 5.6416 8.0743 9.1061 10.9528 4.7169 16.5741 6.7075 14.5178 2.6373 1.8593
temp: 298.150 k
press: 1.00000 atm
elementType: 8 8 8 8 7 7 7 7 7 6 6 6 6 6 6 6 6 6 6 6 1 1 1 1 1 1 1 1 1 1 1
symmnumber: 1
zpe: 590750.0 jmol-1
zpe.correction: 0.225005 hartree
zpe.thermalcorrener: 0.242166 hartree
zpe.thermalcorrenthalpy: 0.243111 hartree
zpe.thermalcorrgfe: 0.177731 hartree
zpe.sumelectzpe: -998.879047 hartree
zpe.sumelectthermal: -998.861885 hartree
zpe.sumelectthermalent: -998.860941 hartree
zpe.sumelectthermalfe: -998.926321 hartree
dipole: -6.4149 -3.2181 -0.9433
dipole: 7.2386
quadrupole: -135.7851 -125.2820 -109.0573
quadrupole: 9.6764 -6.1859 -4.9413
quadrupole: -12.4103 -1.9072 14.3175 9.6764 -6.1859 -4.9413
hfenergy: -999.1040515 hartree
pointgroup: C01 [X(C11H11N5O4)]
dipole: 2.4154591 -1.4851561 0.2651887 debye
polarizability: 284.2147879|27.4972287|183.3380879|0.2699039|-12.1981175|97.2269513 unknown
InChI: InChI=1S/C11H11N5O4/c1-7(17)20-9-2-4-14-8(16(18)19)6-13-11(14)10-12-3-5-15(9)10/h3,5-6,9H,2,4H2,1H3
charge 0 multiplicity 1
31 atoms
O  1.992536 -1.5301 -0.289839
O  -5.134585 -0.355256 -0.072353
O  -3.625598 -1.969791 0.532241
O  4.263237 -1.308985 0.225194
N  1.601793 0.762072 0.389291
N  -1.496878 0.006355 0.142745
N  -1.838595 2.215765 -0.361903
N  0.978484 2.784125 -0.452856
N  -3.922377 -0.752332 0.158319
C  1.647287 -0.622366 0.856799
C  0.330789 -1.150295 1.424423
C  -0.801266 -1.280704 0.39218
C  -0.897878 1.248867 -0.087009
C  0.522647 1.564081 -0.06614
C  -2.885998 0.2171 -0.005774
C  2.764948 1.539006 0.26197
C  -3.053804 1.58162 -0.31525
C  2.356541 2.767618 -0.255758
C  3.368873 -1.785844 -0.50473
C  3.553467 -2.669109 -1.712769
H  2.466346 -0.700633 1.59208
H  0.01371 -0.523087 2.277786
H  0.540108 -2.158918 1.820894
H  -0.399991 -1.664475 -0.562838
H  -1.565468 -1.985967 0.745742
H  3.738186 1.137815 0.534535
H  -3.991538 2.102188 -0.489626
H  2.966513 3.635815 -0.492714
H  3.386928 -2.075344 -2.62997
H  2.819885 -3.491374 -1.714127
H  4.577698 -3.068344 -1.727643
