program: Gaussian 09
title: 000042540
version: EM64L-G09RevD.01
frameworkgroup: C1[X(C12H2Cl6O2)]
method: RPBEPBE
basis: SDD
operation: Freq
keyword: #p
keyword: freq=noraman
keyword: PBEPBE/SDD
title: #p freq=noraman PBEPBE/SDD
converged: NO NO NO NO
title: Mulliken charges:
elementType: Cl Cl Cl Cl Cl Cl O O C C C C C C C C C C C C H H
charge: 0.053077 0.053059 0.056589 0.056587 0.023876 0.023880 -0.251423 -0.251432 0.401788 0.401770 0.313298 0.313280 -0.282966 -0.282950 -0.398048 -0.398051 -0.110124 -0.110141 -0.103130 -0.103136 0.297098 0.297099
chargesum: 0.00000
title: Mulliken charges with hydrogens summed into heavy atoms:
elementType: Cl Cl Cl Cl Cl Cl O O C C C C C C C C C C C C
charge: 0.053077 0.053059 0.056589 0.056587 0.023876 0.023880 -0.251423 -0.251432 0.401788 0.401770 0.313298 0.313280 -0.282966 -0.282950 -0.100950 -0.100951 -0.110124 -0.110141 -0.103130 -0.103136
polarizability: 3.42990936e+02 9.93178860e+00 2.22016664e+02 3.67746618e-04 4.49105769e-03 6.64402130e+01
1716.lowfreq: -1.6954 -0.0037 -0.0031 -0.0029 4.8049 6.2476 21.5981 39.3202 74.3398
frequency: 21.5981 39.3202 74.3357 81.7823 92.7297 120.0138 156.6715 161.9276 162.6013 188.5651 192.9788 200.8649 205.8201 249.4538 254.5654 290.6293 330.4281 330.6748 353.1171 356.2779 364.1931 435.1281 437.9735 519.9824 520.5577 522.8340 531.5147 571.2270 572.6013 592.8765 622.1930 680.7783 693.1332 706.8768 734.2721 783.7057 816.5762 857.9147 858.2472 867.6760 930.4829 950.2314 1108.5110 1121.0566 1153.3883 1155.6538 1230.8867 1287.0777 1340.9418 1342.9232 1360.0829 1367.8541 1431.2881 1434.9026 1548.7693 1570.8406 1578.6974 1620.8605 3181.6462 3181.6945
redmass: 21.0983 21.1285 32.1260 29.4097 21.3492 10.0641 31.7358 11.5221 14.4287 26.1408 27.8486 32.9128 26.5019 22.2858 6.9272 7.7592 28.5259 24.1005 12.1706 12.6732 15.8726 18.8567 13.2787 4.5264 4.6875 8.9650 9.5272 7.8445 12.0003 12.1629 11.3557 13.2411 8.1586 7.5423 9.5972 9.0483 10.4087 1.4050 1.3924 8.6476 13.0354 12.4568 5.4362 7.6234 1.7915 2.0892 5.1971 4.5067 10.6762 10.3994 6.9554 10.8784 5.1293 6.1335 11.1446 8.5492 11.1481 9.4190 1.0930 1.0930
irintensity: 0.0013 0.0813 0.0000 0.0240 0.0848 0.0000 0.0000 0.7408 0.0001 0.0000 0.1373 0.0160 0.0000 0.0000 2.5661 0.0000 0.0000 0.5190 0.0000 4.3214 1.1909 17.7973 0.0000 3.0050 0.0002 15.5355 0.0000 0.0000 0.0858 0.0000 0.0000 0.0000 4.4140 0.0000 22.0553 131.5219 0.0000 0.0010 57.8793 78.1923 215.0137 0.0000 11.1117 0.0000 0.0001 123.1785 0.0000 130.6061 0.0000 74.7117 0.0000 224.3577 1082.0953 0.0122 89.3068 0.0000 0.0000 32.8985 8.3631 0.1591
temp: 298.150 k
press: 1.00000 atm
elementType: 17 17 17 17 17 17 8 8 6 6 6 6 6 6 6 6 6 6 6 6 1 1
symmnumber: 1
zpe: 277847.1 jmol-1
zpe.correction: 0.105826 hartree
zpe.thermalcorrener: 0.123879 hartree
zpe.thermalcorrenthalpy: 0.124823 hartree
zpe.thermalcorrgfe: 0.057421 hartree
zpe.sumelectzpe: -3367.849568 hartree
zpe.sumelectthermal: -3367.831516 hartree
zpe.sumelectthermalent: -3367.830572 hartree
zpe.sumelectthermalfe: -3367.897974 hartree
dipole: 0.0002 -0.0002 -0.0001
dipole: 0.0002
quadrupole: -167.5361 -152.5155 -154.9809
quadrupole: 3.6885 0.0001 0.0006
quadrupole: -9.1919 5.8287 3.3632 3.6885 0.0001 0.0006
hfenergy: -3367.9553947 hartree
pointgroup: C01 [X(C12H2Cl6O2)]
dipole: -0.0000625 -0.0000647 0.0000295 debye
dipolederiv: -0.0136875 -0.0246018 -0.0000004 -0.1046431 -0.5914636 -0.0000051 0.0000094 0.0000244 0.014799 -0.0137022 -0.0246071 -0.0000009 -0.104649 -0.5914541 0.0000361 0.0000177 0.0000553 0.0147859 -0.6398729 -0.2208473 0.0000264 -0.2912759 -0.0922583 0.0000099 0.0000424 0.0000099 0.0152784 -0.6398749 -0.2208435 0.0000046 -0.2912646 -0.0922531 -0.0000003 0.0000059 -0.0000002 0.0152785 -0.5353888 0.3181693 0.0000202 0.4006007 -0.3148197 -0.0000147 0.0000183 -0.000012 -0.0109396 -0.5353729 0.3181733 -0.0000381 0.4006043 -0.3148312 0.0000354 -0.000062 0.0000433 -0.0109369 -2.2427835 0.0420506 -0.0000291 0.1656746 -0.311087 0. -0.0000552 -0.0000368 -0.1287128 -2.2426619 0.0420492 -0.0000203 0.1657196 -0.3110725 0.0000265 -0.0000067 0.0000298 -0.1287164 1.1494815 -0.1962617 -0.0000078 -1.1556995 -0.1192586 -0.0000036 0.000009 0.0000221 0.107332 1.1494448 -0.1962358 0.0000412 -1.1557125 -0.1192741 -0.0000149 0.0000636 0.0000145 0.1073247 1.4946242 0.0819959 0.0000788 0.8497914 0.2106223 0.0000127 0.0001043 0.0000118 0.0784631 1.4945313 0.0819947 -0.0000305 0.8497663 0.2106068 0.0000044 -0.0000668 -0.0000133 0.0784571 -0.2098972 0.0467332 0.0000004 0.0943039 0.9390816 0.0000135 -0.0000306 -0.0000286 -0.0573647 -0.2098945 0.0467406 0.0000074 0.094315 0.9390625 -0.0000697 -0.0000403 -0.0000931 -0.0573566 -0.465911 0.1052975 -0.0000201 0.1305052 -0.1182193 0.0000009 -0.0000413 0.0000133 -0.1069775 -0.4658841 0.1052975 0.0000015 0.1304805 -0.1182224 -0.0000176 0.0000081 -0.0000073 -0.1069703 0.729999 0.4282326 -0.0000413 0.5725932 -0.142907 -0.000024 -0.0000493 -0.0000148 -0.0480348 0.7299988 0.428207 -0.0000262 0.5725801 -0.1429161 0.0000264 -0.0000153 0.0000318 -0.0480357 0.635546 -0.5528558 -0.0000341 -0.6388515 0.4792049 0.0000313 -0.0000279 0.0000209 -0.047227 0.635535 -0.5528495 0.0000636 -0.6388568 0.4792217 -0.0000564 0.0001181 -0.0000777 -0.0472285 0.0978835 -0.0279202 -0.0000024 -0.022992 0.0611137 0.0000077 -0.000012 0.0000053 0.1833908 0.0978875 -0.0279186 0.0000071 -0.02299 0.0611237 0.0000014 0.0000106 0.0000014 0.1833914 unknown
polarizability: 343.4734373|-6.3275115|221.5341631|0.0005008|-0.0044782|66.440213 unknown
InChI: InChI=1S/C12H2Cl6O2/c13-3-1-5-11(9(17)7(3)15)20-6-2-4(14)8(16)10(18)12(6)19-5/h1-2H
charge 0 multiplicity 1
22 atoms
Cl -2.670547 -2.966207 -0.000033
Cl 2.670596 2.966215 -0.000097
Cl -5.332205 -1.097512 0.000142
Cl 5.332252 1.097488 0.000046
Cl -4.975821 2.143178 0.000138
Cl 4.975824 -2.143201 0.000274
O  -0.134893 -1.448447 -0.000103
O  0.134928 1.448477 -0.000163
C  -1.259107 -0.594288 -0.00006
C  1.259139 0.594299 -0.000067
C  1.13047 -0.81658 0.000012
C  -1.130454 0.816581 -0.000086
C  -2.541817 -1.176465 -0.000054
C  2.541849 1.176447 0.000017
C  2.260466 -1.640896 0.000141
C  -2.260453 1.64091 -0.000043
C  -3.697647 -0.352217 0.000039
C  3.697683 0.352206 0.000063
C  -3.542911 1.055091 0.000055
C  3.542938 -1.055094 0.000131
H  2.135033 -2.726631 0.000211
H  -2.135023 2.726647 -0.000067
