program: Gaussian 09
title: 000045599
version: EM64L-G09RevD.01
frameworkgroup: C1[X(C24H31N3O2)]
method: RPBEPBE
basis: SDD
operation: Freq
keyword: #p
keyword: freq=noraman
keyword: PBEPBE/SDD
title: #p freq=noraman PBEPBE/SDD
converged: YES YES NO NO
title: Mulliken charges:
elementType: O O N N N C C C C C C C C C C C C C C C C C C C C C C C C H H H H H H H H H H H H H H H H H H H H H H H H H H H H H H H
charge: -0.312949 -0.287133 -0.065449 -0.183218 -0.456352 -0.355451 -0.374583 -0.375668 -0.422447 -0.415400 -0.572724 0.244385 0.010378 0.337544 0.148112 0.246191 0.172921 0.170937 -0.811843 -0.399180 -0.353466 0.161959 -0.371192 -0.862443 -0.347486 -0.259129 -0.236709 -0.527230 -0.537586 0.205572 0.180557 0.181422 0.210642 0.192982 0.217631 0.204065 0.221215 0.266098 0.214672 0.227542 0.215229 0.296413 0.250780 0.233132 0.237598 0.225191 0.244377 0.235113 0.223646 0.225667 0.277270 0.245241 0.220435 0.226011 0.242085 0.226138 0.219311 0.238334 0.215395 0.215450
chargesum: 0.00000
title: Mulliken charges with hydrogens summed into heavy atoms:
elementType: O O N N N C C C C C C C C C C C C C C C C C C C C C C C C
charge: -0.312949 -0.287133 -0.065449 -0.183218 -0.159939 0.030678 0.017481 0.034945 0.002833 0.065369 -0.129952 0.244385 0.010378 0.337544 0.148112 0.246191 0.172921 0.170937 -0.090334 -0.173989 -0.109088 0.161959 -0.136079 -0.135861 -0.102245 -0.038694 -0.010698 0.160305 0.131593
polarizability: 3.92556375e+02 1.13609155e+00 2.88648985e+02 -2.73417352e+01 9.05623816e+00 2.20404014e+02
1716.lowfreq: -12.9081 -5.6066 -0.5797 -0.0008 -0.0006 0.0006 8.1147 13.1013 26.6079
frequency: -5.8406 13.0745 26.5715 41.1308 59.1082 65.3385 78.2020 85.8503 96.7877 101.9356 114.6934 121.5305 126.9013 145.6682 159.8646 167.4195 177.4534 186.1537 192.3211 228.5128 254.7785 261.2389 265.5560 269.1037 284.3008 287.5955 305.9081 315.1794 338.8226 349.5657 361.7799 373.2540 384.0464 397.5135 413.9357 454.2198 466.0583 476.5547 484.3031 491.9770 501.3546 528.2892 541.0878 550.1840 575.9782 593.1518 602.9522 619.3074 623.9320 655.6423 689.6907 697.3928 743.2195 745.5395 753.8313 759.0251 765.8762 771.2945 777.7698 786.9656 811.3157 845.4074 852.2105 900.6651 904.1169 916.9293 929.2531 947.3688 950.9357 967.1339 978.6170 985.8290 999.5436 1030.7956 1037.2673 1038.2953 1040.8331 1044.2488 1054.0877 1056.5010 1060.8584 1090.5198 1095.2131 1111.6835 1112.3213 1115.5085 1129.5447 1134.4139 1146.7836 1150.4146 1153.9558 1164.7631 1174.4219 1181.0383 1187.1647 1198.8857 1217.7460 1222.0638 1234.1759 1248.1149 1258.1722 1274.3365 1276.2947 1286.7944 1303.1674 1308.1950 1324.2264 1335.9018 1345.5759 1350.4197 1358.7825 1371.9696 1379.7898 1388.7669 1391.3157 1393.2511 1411.0944 1417.2432 1419.2087 1441.2699 1442.0965 1447.1783 1449.9501 1454.7349 1455.7613 1458.3118 1463.0670 1465.6983 1466.3208 1470.8260 1473.2770 1475.2522 1479.1015 1479.9072 1487.6657 1488.0680 1491.9445 1498.6837 1570.7386 1576.0150 1594.0220 1608.1777 1634.0508 2836.4597 2844.5715 2862.9380 2901.7503 2923.1106 2948.5421 2964.0256 2964.9514 2973.6239 3004.6271 3014.6923 3030.8762 3032.0573 3032.1626 3041.2984 3045.7096 3049.6330 3057.1594 3064.9676 3077.5307 3095.6898 3111.7153 3111.9135 3112.1972 3127.0509 3133.0960 3142.9879 3155.7213 3168.3944 3169.0480 3606.6639
redmass: 4.0260 5.0075 4.6823 4.0920 3.2032 3.3920 3.7514 3.6136 2.4832 2.3489 3.9552 1.6420 2.2329 1.2608 1.2958 2.0468 2.8322 3.1800 2.8443 3.2811 2.1003 2.6524 1.6321 2.4615 2.3986 3.6937 2.9166 3.1922 3.2301 3.5938 3.8787 3.9950 2.8154 3.2416 4.1920 4.4194 4.0363 1.5972 1.8922 3.2658 3.4712 3.8817 4.4553 4.5791 3.5704 4.7933 3.8597 3.2040 3.0479 4.3022 4.6696 3.3229 3.6104 4.5648 1.3487 2.5550 4.3591 3.3650 1.5724 1.9719 3.9771 1.5369 1.5007 1.3432 2.4624 4.1665 1.4734 3.1471 3.4725 1.3178 1.8647 2.0567 2.7814 3.1414 1.6034 2.1115 1.8554 1.8619 2.3077 2.2403 2.1621 2.2660 2.0483 1.3120 1.3102 2.1019 1.9526 2.5423 2.5250 1.3776 1.9283 1.3860 1.6389 2.4880 1.7846 1.1246 1.6677 1.8370 1.6091 1.7026 1.4322 1.4842 1.4563 1.3293 1.3651 2.9631 4.3261 1.3351 1.5180 1.6878 1.5642 2.7114 1.6590 1.3714 1.3074 2.1072 1.9293 1.3232 1.9408 1.3216 1.8366 2.5788 1.1005 1.0711 1.1062 1.1068 1.3364 1.0555 1.1256 1.0831 1.1400 1.1587 1.1196 1.0654 1.0588 2.6627 1.4046 1.7747 6.4700 6.7430 6.2398 6.4781 7.1953 1.0713 1.0702 1.0695 1.0684 1.0698 1.0332 1.0305 1.0395 1.0412 1.0619 1.0880 1.0886 1.1031 1.0980 1.0907 1.0893 1.0944 1.1040 1.0985 1.0923 1.0948 1.0963 1.1021 1.0981 1.0850 1.0891 1.0893 1.0936 1.1003 1.0937 1.0803
irintensity: 0.3229 0.0723 0.3071 0.9332 5.1757 0.4887 0.3539 0.5787 4.2782 0.9317 1.7176 0.5176 1.5107 0.5077 1.6412 3.0789 6.8524 2.6881 2.4758 4.3907 5.6112 1.4476 0.8006 5.5288 0.0953 4.2946 4.1978 10.4774 0.5025 2.2210 1.0129 0.4157 1.8192 1.4113 4.0820 7.5590 1.0558 53.4062 36.8160 8.9188 0.6913 2.5948 3.0161 0.0926 3.0115 2.4228 5.0551 10.4586 4.6929 5.0335 5.7385 11.6130 6.3416 2.2580 72.4504 3.7974 4.1986 18.2916 55.7598 2.0929 13.8871 0.0734 0.3213 0.8021 0.0165 38.5645 1.6193 19.0077 28.7878 0.9711 0.2256 5.3027 64.5404 24.2127 13.8238 30.5878 8.1831 0.5129 4.7243 8.1194 29.3618 24.1505 39.6844 15.5247 23.0635 108.1604 6.9985 46.2653 27.4005 1.6750 14.8127 5.1627 9.8120 42.0211 43.3519 8.5862 12.9127 40.4304 153.7254 57.7905 17.9885 5.2035 15.0639 11.5528 22.6033 31.7273 24.0903 13.0923 6.8133 15.3209 5.6911 21.2851 34.2100 10.2454 7.8853 12.3569 36.2639 3.0544 58.9891 4.2989 11.0120 6.1455 3.6555 22.4807 50.1950 11.4618 5.8371 8.8212 14.1013 16.1507 35.7671 2.6958 43.5884 5.4046 12.4504 146.5330 17.2886 43.0402 0.9944 6.6594 35.4049 51.3720 4.5009 47.3482 56.7179 140.5606 65.8489 93.7640 101.5024 67.5064 64.1866 34.4872 39.2844 8.8546 43.8430 36.9012 40.2214 48.4430 22.8850 22.4468 30.6861 34.7317 5.2818 15.8985 18.6995 24.0759 17.6197 3.9530 10.8156 15.3010 28.0431 18.9497 17.9615 50.7055
temp: 298.150 k
press: 1.00000 atm
elementType: 8 8 7 7 7 6 6 6 6 6 6 6 6 6 6 6 6 6 6 6 6 6 6 6 6 6 6 6 6 1 1 1 1 1 1 1 1 1 1 1 1 1 1 1 1 1 1 1 1 1 1 1 1 1 1 1 1 1 1 1
symmnumber: 1
zpe: 1323066.4 jmol-1
zpe.correction: 0.503929 hartree
zpe.thermalcorrener: 0.531703 hartree
zpe.thermalcorrenthalpy: 0.532647 hartree
zpe.thermalcorrgfe: 0.445412 hartree
zpe.sumelectzpe: -1245.656861 hartree
zpe.sumelectthermal: -1245.629087 hartree
zpe.sumelectthermalent: -1245.628143 hartree
zpe.sumelectthermalfe: -1245.715378 hartree
dipole: -3.8549 0.9246 0.6960
dipole: 4.0248
quadrupole: -162.7930 -157.1536 -170.8658
quadrupole: -11.6425 -9.3226 0.2495
quadrupole: 0.8111 6.4505 -7.2616 -11.6425 -9.3226 0.2495
hfenergy: -1246.16079 hartree
pointgroup: C01 [X(C24H31N3O2)]
dipole: -1.5421257 -0.2373994 -0.2700877 debye
polarizability: 393.7436255|-10.2935863|284.2160294|20.7077269|19.4537914|223.6497185 unknown
InChI: InChI=1S/C24H31N3O2/c1-17-22(28-3)10-9-20-24(17)19(18(2)25-20)11-12-26-13-15-27(16-14-26)21-7-5-6-8-23(21)29-4/h5-10,25H,11-16H2,1-4H3
charge 0 multiplicity 1
60 atoms
O  5.437863 -0.004598 -2.188582
O  -4.908243 3.334863 0.818684
N  0.856208 -1.045287 0.00595
N  3.636243 -0.211339 0.098213
N  -4.986982 -2.117164 -0.355895
C  1.283052 0.143208 0.781784
C  1.748158 -1.220982 -1.167528
C  -0.577844 -1.007054 -0.374167
C  2.741144 0.00503 1.254222
C  3.208722 -1.380741 -0.720941
C  -1.52902 -1.297194 0.818008
C  -2.986537 -1.31764 0.409702
C  -3.93776 -0.206776 0.35146
C  5.033075 -0.007368 0.27816
C  -3.665101 -2.463317 -0.031283
C  -5.183732 -0.749753 -0.131892
C  -3.855584 1.184066 0.668071
C  5.916056 0.089254 -0.8507
C  -3.190824 -3.881548 -0.181486
C  -6.337407 0.033721 -0.310589
C  5.617112 0.140845 1.569893
C  -5.031503 1.960486 0.484261
C  -6.252736 1.404044 0.002758
C  -2.591015 1.840738 1.190489
C  7.303505 0.252427 -0.678292
C  7.005319 0.336654 1.736157
C  7.86247 0.374309 0.614486
C  4.621511 1.152781 -2.617067
C  -6.075152 4.188799 0.624211
H  0.635374 0.253185 1.669759
H  1.189071 1.078606 0.169905
H  1.675752 -0.352473 -1.87274
H  1.437769 -2.1299 -1.715698
H  -0.858014 -0.02951 -0.844038
H  -0.744419 -1.784156 -1.144618
H  2.803497 -0.8376 1.982846
H  3.037636 0.935188 1.771435
H  3.868879 -1.460066 -1.599052
H  3.299938 -2.313171 -0.118575
H  -1.371246 -0.549392 1.613797
H  -1.228974 -2.271615 1.247103
H  -5.694949 -2.76745 -0.689079
H  -2.162445 -3.98785 0.199767
H  -3.830107 -4.590371 0.380349
H  -3.186955 -4.207112 -1.240448
H  -7.275483 -0.395909 -0.678781
H  4.983257 0.0703 2.459009
H  -7.137088 2.034282 -0.125113
H  -2.373807 1.525336 2.229662
H  -1.714183 1.576504 0.572003
H  -2.699972 2.935536 1.191888
H  7.925722 0.302054 -1.578225
H  7.416008 0.439602 2.747018
H  8.942125 0.508028 0.738671
H  3.737628 1.273245 -1.963602
H  4.311419 0.930272 -3.650006
H  5.232041 2.075928 -2.597629
H  -5.749502 5.194968 0.929693
H  -6.926362 3.868423 1.25788
H  -6.395607 4.209753 -0.436765
