program: Gaussian 09
title: 000042499
version: EM64L-G09RevD.01
frameworkgroup: C1[X(C13H18ClN3O2)]
method: RPBEPBE
basis: SDD
operation: Freq
keyword: #p
keyword: freq=noraman
keyword: PBEPBE/SDD
title: #p freq=noraman PBEPBE/SDD
converged: YES YES NO NO
title: Mulliken charges:
elementType: Cl O O N N N C C C C C C C C C C C C C H H H H H H H H H H H H H H H H H H
charge: -0.081905 -0.286104 -0.270386 -0.272971 -0.399826 -0.686657 -0.058306 -0.422645 -0.384547 -0.429646 -0.429562 0.158354 0.180684 0.201969 -0.372621 -0.567215 -0.395978 0.679192 -0.531648 0.266041 0.220756 0.208126 0.228752 0.214545 0.160012 0.225574 0.219495 0.179653 0.266381 0.309236 0.268983 0.249471 0.320595 0.314562 0.207590 0.225951 0.284092
chargesum: 0.00000
title: Mulliken charges with hydrogens summed into heavy atoms:
elementType: Cl O O N N N C C C C C C C C C C C C C
charge: -0.081905 -0.286104 -0.270386 -0.006590 -0.090590 -0.051500 0.207735 0.006238 0.058750 -0.044060 -0.030414 0.158354 0.180684 0.201969 -0.103638 -0.317744 -0.395978 0.679192 0.185985
polarizability: 2.43002156e+02 -1.52037327e+01 1.97540682e+02 -1.41869533e+01 -3.29660456e+00 1.15727350e+02
1716.lowfreq: -13.2986 -3.1103 0.0009 0.0017 0.0020 5.5377 17.7247 33.6896 45.7869
frequency: 17.3816 33.5414 45.6902 58.8683 86.7290 101.1328 127.5590 150.5775 190.8242 202.6358 218.5076 229.5873 244.7862 253.7027 278.3238 295.3992 315.3960 348.3701 362.9692 378.4620 398.4122 408.5119 430.7605 452.6818 468.7741 474.4897 498.7663 546.4900 551.0707 600.4462 616.4217 626.7972 672.6188 688.6168 714.7440 721.6202 749.9149 789.4567 799.8040 844.8045 859.5045 874.2797 884.7204 903.1854 924.1248 953.0657 1005.2820 1024.4672 1028.0226 1046.5552 1061.1083 1091.1212 1102.6902 1117.3021 1125.5594 1135.6054 1155.0409 1175.6641 1186.7711 1193.4878 1235.7899 1247.9080 1251.6002 1282.5752 1295.0054 1304.9935 1313.7585 1329.2729 1339.1051 1358.3921 1379.9609 1386.9610 1414.3287 1438.2418 1447.7822 1449.0893 1452.5652 1453.1229 1455.9969 1469.4137 1476.9310 1481.2703 1504.6492 1544.1043 1582.4066 1618.2458 1643.7532 2799.1595 2842.2841 2971.2517 2997.4903 3002.2910 3027.1480 3036.3509 3041.5723 3065.8267 3072.5805 3082.7796 3122.2258 3154.4265 3156.9294 3459.1176 3539.5927 3554.3662 3701.7518
redmass: 4.7695 4.3770 4.0724 4.7578 5.3813 3.8355 5.4156 5.7406 2.8434 3.9506 2.0184 3.2672 4.2594 3.9780 2.0375 5.0005 3.0912 6.4307 3.1822 2.2603 2.9014 1.2516 2.8024 2.1495 3.0527 1.5909 1.9095 3.6334 1.2821 5.0512 3.3872 3.2304 5.0856 2.1049 5.6397 3.5156 4.8280 3.2593 1.8193 3.9696 1.9083 2.3677 1.4114 2.3931 6.3972 2.7035 1.5240 2.4731 2.8924 1.6673 1.7194 1.4824 2.5144 1.2874 2.2782 2.3957 1.4737 1.1841 1.6434 2.5987 1.6824 1.3915 1.4261 1.2723 2.7188 1.7725 1.3461 1.5701 1.4609 1.3403 3.0767 1.4642 4.8380 1.1418 1.5028 1.2938 1.3244 1.1341 1.2855 1.0904 1.0718 1.1421 4.2227 6.6293 6.2826 1.7043 2.5947 1.0715 1.0709 1.0345 1.0621 1.0619 1.0844 1.0863 1.0885 1.1020 1.1024 1.0972 1.1055 1.0908 1.0917 1.0753 1.0774 1.0454 1.1037
irintensity: 0.1945 0.5631 0.1463 2.1580 2.7476 10.6452 1.0323 3.3083 1.5405 0.2616 0.4407 1.3734 1.3735 3.7958 12.4525 8.5872 9.3164 3.0825 5.6011 12.7078 6.3245 131.5656 19.2046 111.0211 20.6177 43.7324 26.4756 4.5046 86.4327 8.8947 64.8222 36.7627 35.2790 16.1825 17.1695 0.8660 6.8439 7.7198 2.9739 7.2702 39.1327 3.1996 19.2364 9.2040 18.5335 6.3156 1.1336 28.3443 9.9878 0.8318 1.9658 11.8240 27.7120 0.5729 10.0448 28.4347 5.1198 11.2819 0.9830 179.3790 50.9084 2.5707 130.5750 26.1158 13.4638 50.1752 42.1184 28.3331 10.9760 6.6977 64.1529 3.1688 1.0081 65.0287 208.2873 38.8909 62.0184 42.8004 145.6097 16.8378 47.1363 48.7463 69.3712 40.9364 162.4678 9.1077 493.6666 136.9930 135.9127 58.7379 20.7859 16.7958 30.2986 67.8395 40.9573 26.2753 49.0512 38.8106 16.2369 4.6037 2.2322 0.8196 28.7568 107.4908 36.8571
temp: 298.150 k
press: 1.00000 atm
elementType: 17 8 8 7 7 7 6 6 6 6 6 6 6 6 6 6 6 6 6 1 1 1 1 1 1 1 1 1 1 1 1 1 1 1 1 1 1
symmnumber: 1
zpe: 787307.7 jmol-1
zpe.correction: 0.299870 hartree
zpe.thermalcorrener: 0.318798 hartree
zpe.thermalcorrenthalpy: 0.319743 hartree
zpe.thermalcorrgfe: 0.251461 hartree
zpe.sumelectzpe: -1279.503619 hartree
zpe.sumelectthermal: -1279.484691 hartree
zpe.sumelectthermalent: -1279.483746 hartree
zpe.sumelectthermalfe: -1279.552028 hartree
dipole: 0.2046 -1.3693 -3.8876
dipole: 4.1268
quadrupole: -99.7829 -119.5916 -123.4343
quadrupole: 4.0669 0.0568 -5.9705
quadrupole: 14.4867 -5.3220 -9.1647 4.0669 0.0568 -5.9705
hfenergy: -1279.8034889 hartree
pointgroup: C01 [X(C13H18Cl1N3O2)]
dipole: 0.0167478 0.8855136 1.3607469 debye
polarizability: 237.026742|24.2141321|198.6707168|6.700268|-21.211096|120.5727289 unknown
InChI: InChI=1S/C13H18ClN3O2/c1-19-12-7-11(15)10(14)6-9(12)13(18)17-8-2-4-16-5-3-8/h6-8,16-17H,2-5,15H2,1H3
charge 0 multiplicity 1
37 atoms
Cl 3.08004 3.313664 -0.918872
O  -0.466501 -1.854783 -1.247183
O  2.002296 -2.348096 0.864515
N  -4.547316 0.687253 1.284455
N  -1.334028 0.112678 -0.369298
N  5.029622 1.309817 0.319457
C  -2.714389 -0.158709 -0.833572
C  -3.516263 1.163457 -0.909212
C  -3.442359 -1.17277 0.09325
C  -3.841754 1.71851 0.497574
C  -3.756012 -0.551751 1.469037
C  -0.28078 -0.749658 -0.637714
C  1.072856 -0.247679 -0.214532
C  2.10819 -1.043841 0.375961
C  1.413425 1.088976 -0.579278
C  3.409582 -0.515981 0.544983
C  2.69936 1.59447 -0.396227
C  3.749828 0.80413 0.157942
C  0.702314 -2.955284 1.185958
H  -2.62069 -0.609611 -1.83849
H  -4.47107 0.957037 -1.425845
H  -2.961607 1.916183 -1.501501
H  -2.818312 -2.077645 0.201474
H  -4.3930 -1.466526 -0.390594
H  -2.893769 2.066056 0.992909
H  -4.491939 2.607167 0.403618
H  -4.345631 -1.261406 2.077248
H  -2.792334 -0.367106 2.011348
H  -4.926099 1.052499 2.166864
H  -1.165767 0.926775 0.224669
H  0.662955 1.715093 -1.071885
H  4.157962 -1.162349 1.01442
H  5.238382 2.262797 0.031215
H  5.773578 0.728797 0.692988
H  0.043473 -2.230933 1.703738
H  0.946614 -3.788153 1.863599
H  0.206343 -3.314175 0.270481
