program: Gaussian 09
title: 000042464
version: EM64L-G09RevD.01
frameworkgroup: C1[X(C12H13NO4)]
method: RPBEPBE
basis: SDD
operation: Freq
keyword: #p
keyword: freq=noraman
keyword: PBEPBE/SDD
title: #p freq=noraman PBEPBE/SDD
converged: NO YES NO NO
title: Mulliken charges:
elementType: O O O O N C C C C C C C C C C C C H H H H H H H H H H H H H
charge: -0.294307 -0.263974 -0.175415 -0.175380 -0.027856 0.148433 0.378365 -0.685211 -0.685542 0.414049 0.125938 -0.430393 -0.527852 -0.354446 0.300644 -0.337696 -0.537050 0.241428 0.239840 0.225439 0.240025 0.241734 0.224996 0.263830 0.247570 0.256801 0.257369 0.220236 0.248180 0.220244
chargesum: 0.00000
title: Mulliken charges with hydrogens summed into heavy atoms:
elementType: O O O O N C C C C C C C C C C C C
charge: -0.294307 -0.263974 -0.175415 -0.175380 -0.027856 0.148433 0.378365 0.021496 0.021213 0.414049 0.125938 -0.166563 -0.280282 -0.097645 0.300644 -0.080327 0.151610
polarizability: 2.37777051e+02 8.95029420e-01 1.48350553e+02 -4.07575726e-02 -8.68021218e-04 9.90977389e+01
1716.lowfreq: -89.4779 -60.4554 -8.3710 -3.3711 -0.0010 -0.0007 -0.0005 5.3562 65.0772
frequency: -89.4718 -60.2881 65.0767 74.7869 124.4578 140.6557 162.8801 191.1867 195.8542 232.6801 238.1102 250.4929 270.9694 291.3906 305.9487 331.6353 353.4564 407.7889 423.3226 427.6749 459.2782 497.8161 532.1377 587.5068 599.7210 605.4383 653.2693 695.9856 711.5291 731.1550 753.3524 775.5528 823.7149 846.4034 856.0973 907.5676 921.3525 933.6461 946.4973 949.5798 985.9917 1000.2810 1001.7544 1114.5950 1115.3091 1130.9542 1156.3382 1176.8434 1184.7777 1204.0161 1220.7988 1230.7742 1263.0661 1270.6583 1334.7114 1360.6963 1382.6388 1396.6654 1399.8593 1424.7177 1447.9744 1450.5052 1457.0778 1467.2701 1468.8995 1470.5444 1479.7125 1485.7599 1585.2057 1618.1225 1663.0258 2955.2191 3000.4384 3003.2907 3040.5044 3101.4050 3107.9181 3111.3010 3115.1261 3127.3620 3140.3373 3152.0056 3161.0812 3181.0714
redmass: 11.3922 3.7371 5.7349 3.5399 6.2905 3.8435 2.2964 3.9359 1.3603 1.0605 1.2253 3.2798 3.2238 8.5756 2.9910 3.8626 5.3278 4.1907 3.5153 4.1050 3.0734 4.0267 7.9253 6.4293 3.3777 5.9846 4.8432 6.9081 7.9346 3.2636 5.3406 5.1751 1.4427 1.5737 4.5443 1.5495 1.4931 5.0340 2.4701 1.3439 3.6831 1.2944 4.5427 1.2600 1.4110 2.1623 1.3562 1.9206 3.8721 2.3416 3.4628 10.3441 1.6031 2.8585 1.9842 7.1318 1.2891 8.4979 1.2182 2.0716 1.6746 1.0613 1.0478 1.0496 1.0903 1.2655 1.0697 1.8989 8.5338 6.5843 8.8478 1.0336 1.0348 1.0353 1.1037 1.1004 1.0998 1.1015 1.1011 1.0987 1.0931 1.0909 1.0882 1.0973
irintensity: 0.0023 1.7613 1.3656 1.3360 3.7795 6.8588 0.1540 3.4110 0.8176 1.0608 0.2923 1.5139 2.3294 1.1881 2.8035 0.5196 0.3143 0.9511 7.0384 1.9755 9.8179 0.5694 1.3071 31.7698 1.2401 1.9427 8.6794 17.1289 17.6916 4.0886 5.6668 1.5530 44.5060 15.7522 43.4036 30.1881 0.6775 6.2547 14.5923 0.1060 1.8884 0.0516 63.3151 0.1321 9.7831 136.6358 2.4698 80.8951 18.7245 45.5334 68.6130 238.5586 0.2109 74.3607 4.8772 193.1496 2.4724 13.8168 14.9755 58.0437 2.0949 7.6340 1.0216 13.9125 3.1635 174.5315 16.3265 61.8438 11.7326 17.2558 16.5237 61.6336 6.8776 12.8553 50.7387 1.5338 20.2103 10.2072 26.0858 27.0177 3.9674 9.0092 2.3414 4.4586
temp: 298.150 k
press: 1.00000 atm
elementType: 8 8 8 8 7 6 6 6 6 6 6 6 6 6 6 6 6 1 1 1 1 1 1 1 1 1 1 1 1 1
symmnumber: 1
zpe: 600660.4 jmol-1
zpe.correction: 0.228779 hartree
zpe.thermalcorrener: 0.243381 hartree
zpe.thermalcorrenthalpy: 0.244325 hartree
zpe.thermalcorrgfe: 0.187999 hartree
zpe.sumelectzpe: -819.353204 hartree
zpe.sumelectthermal: -819.338603 hartree
zpe.sumelectthermalent: -819.337658 hartree
zpe.sumelectthermalfe: -819.393985 hartree
dipole: 2.6058 0.0882 0.0102
dipole: 2.6073
quadrupole: -101.9715 -93.6255 -104.4542
quadrupole: -19.1179 0.0085 -0.0150
quadrupole: -1.9545 6.3916 -4.4372 -19.1179 0.0085 -0.0150
hfenergy: -819.5819837 hartree
pointgroup: C01 [X(C12H13N1O4)]
dipole: -1.0256529 0.0161362 0.0043188 debye
polarizability: 237.6462172|-3.5334117|148.4813775|0.0002695|-0.0321448|99.0977479 unknown
InChI: InChI=1S/C12H13NO4/c1-12(2)11(13(14)15)7-8-6-9(16-3)4-5-10(8)17-12/h4-7H,1-3H3
charge 0 multiplicity 1
30 atoms
O  0.686049 -1.757398 -0.003928
O  -4.436258 0.569347 0.001422
O  3.498518 1.656411 1.138556
O  3.492592 1.661306 -1.145663
N  2.994522 1.326414 -0.002975
C  2.005577 -1.022182 0.000784
C  1.76616 0.492368 -0.001571
C  2.730504 -1.485197 1.283793
C  2.739965 -1.487722 -1.275807
C  -0.672012 0.314782 -0.000988
C  -0.552286 -1.099239 -0.002008
C  0.554828 1.104884 -0.00204
C  -1.962067 0.91052 0.000191
C  -1.705669 -1.914005 -0.002032
C  -3.113985 0.094621 0.000321
C  -2.979425 -1.319267 -0.000839
C  -4.629965 2.019228 0.002438
H  2.179242 -1.163533 2.182355
H  2.790216 -2.586625 1.278359
H  3.753548 -1.074497 1.335747
H  2.79819 -2.589202 -1.268454
H  2.196332 -1.166546 -2.179159
H  3.764009 -1.078586 -1.320002
H  0.487331 2.19875 -0.003339
H  -2.037317 2.00264 0.000888
H  -1.59142 -3.001459 -0.002983
H  -3.886716 -1.93025 -0.000768
H  -4.191976 2.48486 0.90749
H  -5.719746 2.165122 0.003228
H  -4.193142 2.485955 -0.902615
