program: Gaussian 09
title: 000042427
version: EM64L-G09RevD.01
frameworkgroup: C1[X(C10H7BrO2)]
method: RPBEPBE
basis: SDD
operation: Freq
keyword: #p
keyword: freq=noraman
keyword: PBEPBE/SDD
title: #p freq=noraman PBEPBE/SDD
converged: YES YES NO NO
title: Mulliken charges:
elementType: Br O O C C C C C C C C C C H H H H H H H
charge: 0.016968 -0.253070 -0.212418 0.367426 0.168791 -0.423771 0.333262 -0.434633 -0.308346 -0.343470 -0.252363 -0.154616 -0.218611 0.266730 0.235587 0.255866 0.258278 0.265924 0.257160 0.175305
chargesum: 0.00000
title: Mulliken charges with hydrogens summed into heavy atoms:
elementType: Br O O C C C C C C C C C C
charge: 0.016968 -0.253070 -0.212418 0.367426 0.168791 0.078545 0.333262 -0.178767 -0.050068 -0.077546 -0.252363 0.102544 -0.043306
polarizability: 2.60154248e+02 1.06935438e+01 1.23067930e+02 -1.91545454e+00 9.45851997e-01 5.15999815e+01
1716.lowfreq: -9.0983 -5.2376 -0.0006 -0.0005 0.0003 3.5478 59.7932 72.9763 117.5763
frequency: 59.7888 72.9734 117.5762 140.6377 168.9798 197.1044 254.7950 297.5580 338.7801 352.9588 402.5122 433.4765 456.7443 539.9891 570.4232 592.3012 611.3902 703.7953 734.0667 742.6708 825.3269 864.3483 875.2562 881.4652 911.8548 955.5078 961.7000 970.9015 1015.3728 1064.3901 1115.9179 1170.6883 1197.4948 1205.7375 1253.3912 1267.5894 1323.0497 1356.2490 1375.0877 1393.4893 1413.2205 1456.5315 1472.4032 1549.6949 1575.4351 1606.1636 1633.7627 2880.5727 2973.6959 3100.1896 3118.7084 3153.8898 3164.0180 3182.9296
redmass: 8.2698 3.2035 9.9352 4.6271 4.4920 7.3442 12.2583 4.4863 3.8877 6.4730 3.8953 3.1174 3.0570 5.4346 3.5283 7.5384 7.9992 5.8829 3.6085 4.8597 1.4533 1.3758 4.7583 3.5774 1.6756 1.3641 7.7517 1.6405 1.8669 2.1292 1.8647 1.5124 1.1932 1.9513 2.7627 1.4583 1.7261 1.4656 3.5190 2.8294 3.4109 2.3323 1.1658 6.7579 7.2073 7.5635 6.8709 1.0858 1.0691 1.0948 1.0921 1.0929 1.0887 1.0974
irintensity: 2.6312 0.9737 2.8911 3.3315 13.7845 8.1108 2.2580 1.3069 3.6262 2.0116 5.4926 3.0539 10.5368 15.2400 4.9878 14.0200 41.2495 17.7236 2.5076 1.5463 50.7092 1.5287 38.9510 2.1282 17.6233 0.7032 7.2694 17.3077 5.1655 28.3201 37.2646 77.0670 4.0106 156.6352 13.9465 5.1319 53.1604 3.5194 22.6422 24.0433 81.5097 35.6288 19.7862 112.2252 312.1841 11.5706 168.3295 114.9770 46.0060 3.9502 8.8073 1.6856 0.4037 2.6440
temp: 298.150 k
press: 1.00000 atm
elementType: 35 8 8 6 6 6 6 6 6 6 6 6 6 1 1 1 1 1 1 1
symmnumber: 1
zpe: 371168.7 jmol-1
zpe.correction: 0.141371 hartree
zpe.thermalcorrener: 0.152482 hartree
zpe.thermalcorrenthalpy: 0.153426 hartree
zpe.thermalcorrgfe: 0.102800 hartree
zpe.sumelectzpe: -548.232896 hartree
zpe.sumelectthermal: -548.221785 hartree
zpe.sumelectthermalent: -548.220841 hartree
zpe.sumelectthermalfe: -548.271467 hartree
dipole: 2.0956 -0.2510 0.4015
dipole: 2.1484
quadrupole: -111.1591 -75.5751 -86.2886
quadrupole: 1.4650 -1.5912 1.3356
quadrupole: -20.1515 15.4325 4.7190 1.4650 -1.5912 1.3356
hfenergy: -548.3742669 hartree
pointgroup: C01 [X(C10H7Br1O2)]
dipole: -0.7955315 0.2189335 0.1833964 debye
dipolederiv: -0.6166347 0.2362171 0.0294175 0.3433531 -0.1924759 -0.0185368 0.0411101 -0.0204059 -0.0304104 -0.9493105 0.4529171 -0.0621585 0.2939294 -0.4658836 0.0248232 0.0665455 -0.0556455 -0.2887774 -1.4828051 -0.0656726 0.0292122 0.3606589 -0.4091792 0.0087265 -0.0266459 0.0143489 -0.3422995 -0.6614899 -0.1855515 -0.0162396 -0.1818942 -0.2366719 0.0069 0.0255859 -0.0305206 -0.0183283 0.673962 -0.5249571 -0.0501224 -0.2128596 0.3646478 -0.0396452 -0.1261784 0.0435399 0.0965271 0.5236817 -0.1245257 0.1255111 0.0446872 0.1319382 0.0077467 0.1031457 -0.0424394 0.4224124 -1.4805672 -0.2135555 -0.0049606 -0.33356 -0.0862425 -0.0178206 0.111899 0.0127203 -0.0555654 1.0507289 0.2506883 -0.0085261 0.1500549 0.1322262 -0.02209 -0.0502637 -0.0258644 -0.1160822 0.1712777 0.2556994 0.0263158 0.0755465 0.0088439 0.0026725 0.0612701 0.0086981 -0.0807892 -0.1999319 0.222005 0.0206987 0.051259 0.0789338 0.0288857 0.0221725 0.0472405 -0.1609197 0.8678512 -0.6036318 -0.0763462 -1.0129225 0.057254 0.0332291 -0.1065782 0.0430649 -0.1440981 -0.3138076 0.0713649 0.004234 0.2911567 0.1304197 0.0143415 0.0287245 0.0049756 -0.0722306 2.0909985 0.1367684 -0.0527202 0.324431 0.6822353 -0.0829843 -0.0613513 -0.0710979 0.1112465 -0.0093345 0.0678184 0.0287507 0.0063545 0.0729261 -0.0299646 0.0398024 -0.0492713 0.0624993 0.0565761 -0.0009147 0.0055652 0.0020956 0.0507262 0.0342886 -0.1087839 0.0898835 -0.1299253 0.0691625 0.0008032 0.0059737 -0.0471127 -0.0653685 0.0293817 -0.012687 0.0268663 0.1532515 0.1030056 -0.0262892 0.0012783 0.006669 -0.0349427 -0.0104721 -0.0126142 -0.0122654 0.1564424 0.0684069 0.0292434 0.0044716 -0.0044856 -0.0334004 -0.0155711 -0.0033045 -0.0117215 0.1731534 -0.0116347 -0.0654426 -0.0020002 -0.0536315 0.079603 -0.0045153 -0.0037446 -0.0081341 0.157923 0.049865 0.0870156 -0.0083548 -0.1037297 -0.2655896 0.0506046 0.0118961 0.0360279 0.1059706 unknown
polarizability: 260.1303349|-10.5576166|123.0530144|-3.489818|1.1512779|51.6388106 unknown
InChI: InChI=1S/C10H7BrO2/c11-9-1-2-10-8(4-9)3-7(5-12)6-13-10/h1-5H,6H2
charge 0 multiplicity 1
20 atoms
Br -4.469852 1.430528 0.182265
O  0.808508 -1.733996 -0.202699
O  4.537115 0.427944 -0.110338
C  -0.333372 0.446409 0.012389
C  -0.35954 -0.9830 -0.073945
C  2.080144 -1.102999 0.256273
C  2.125792 0.38981 -0.007774
C  0.9571 1.112703 -0.071002
C  -1.563436 1.155621 0.083515
C  -1.586834 -1.677448 -0.119501
C  -2.77578 0.448494 0.067244
C  -2.800442 -0.962438 -0.041364
C  3.431837 1.044334 -0.149291
H  2.880989 -1.629783 -0.284581
H  2.19094 -1.315279 1.339343
H  0.987452 2.199813 -0.221588
H  -1.553823 2.248581 0.145643
H  -1.581502 -2.767097 -0.209793
H  -3.753246 -1.498712 -0.062499
H  3.39165 2.153615 -0.292397
