program: Gaussian 16
title: Title
version: ES64L-G16RevC.02
method: RPBE1PBE
basis: def2TZVPP
operation: Freq
keyword: #N
keyword: Geom=AllCheck
keyword: Guess=TCheck
keyword: SCRF=Check
keyword: GenChk
keyword: RPBE1PBE/def2TZVPP
keyword: Freq
converged: YES YES YES YES
title: Mulliken charges:
elementType: V V V O O O O O O V O O O O V O O O V C C C C H H H H H H O O O O O C C O C H H H H C H H N H N H C C O O C H H C H H Cl Cl
charge: 0.708958 0.657672 0.666768 -0.903561 -0.415805 -0.242326 -0.340182 -0.243102 -0.340351 0.666809 -0.251907 -0.243086 -0.336606 -0.397161 0.708917 -0.251911 -0.340179 -0.399211 0.657482 -0.017376 -0.014236 0.002395 0.195167 0.078395 0.074151 0.080826 0.090463 0.077103 0.092070 -0.242448 -0.336573 -0.399250 -0.340319 -0.397178 -0.017420 -0.014124 -0.415850 0.195105 0.080834 0.090476 0.078392 0.074149 0.002358 0.077105 0.092076 -0.185116 0.139370 -0.185118 0.139367 0.186708 0.186704 -0.400057 -0.400059 -0.073303 0.110689 0.126993 -0.073309 0.126993 0.110694 -0.179030 -0.179034
chargesum: -2.00000
title: Mulliken charges with hydrogens summed into heavy atoms:
elementType: V V V O O O O O O V O O O O V O O O V C C C C O O O O O C C O C C N N C C O O C C Cl Cl
charge: 0.708958 0.657672 0.666768 -0.903561 -0.415805 -0.242326 -0.340182 -0.243102 -0.340351 0.666809 -0.251907 -0.243086 -0.336606 -0.397161 0.708917 -0.251911 -0.340179 -0.399211 0.657482 0.153913 0.138310 0.171568 0.195167 -0.242448 -0.336573 -0.399250 -0.340319 -0.397178 0.153890 0.138418 -0.415850 0.195105 0.171540 -0.045746 -0.045752 0.186708 0.186704 -0.400057 -0.400059 0.164379 0.164378 -0.179030 -0.179034
1716.lowfreq: -1.5725 -0.0014 0.0021 0.0029 1.8991 5.2235 18.1345 20.5260 33.4065
frequency: 18.1345 20.5245 33.4065 38.5141 41.6994 44.8836 59.4244 74.4715 95.6304 127.4339 142.9860 144.5518 145.6459 160.4487 165.0795 170.7400 174.7853 184.7183 187.0882 190.4943 191.7283 200.2475 206.5769 208.7884 214.9269 221.3620 226.9530 230.6434 230.9198 232.1917 236.2853 240.5836 245.4428 246.5894 247.4087 249.1051 257.9552 263.8115 273.2239 276.8422 281.0984 282.0544 290.5376 296.2105 303.1268 319.6996 320.8754 327.8032 330.1719 338.1522 343.3064 351.4080 381.5750 383.4626 390.4692 391.0647 395.6914 397.6174 402.0091 438.2410 438.4520 440.6713 440.9084 443.5004 444.8424 449.6542 455.9021 456.5790 461.0696 461.8690 470.2223 471.7112 474.1371 485.5071 495.2347 502.4024 508.1530 515.9191 523.0546 525.6177 586.8354 586.9201 645.0105 647.6976 648.5142 663.0188 668.7138 669.8120 680.0169 681.4364 710.4097 711.9332 760.8028 760.8895 764.6197 766.0750 813.6503 814.1410 820.2517 820.8748 850.2999 908.6811 908.7992 941.4978 941.5266 962.0964 962.2436 993.4311 993.4447 1006.8008 1006.8713 1043.4743 1043.9277 1051.0544 1052.7406 1054.8591 1088.4819 1130.2906 1131.6134 1137.1354 1138.1275 1146.2591 1146.4650 1178.8307 1178.8696 1190.8874 1198.4467 1219.6000 1219.6057 1228.4775 1228.5178 1272.7435 1272.9988 1288.7841 1288.8846 1338.7494 1338.7576 1342.5800 1342.5845 1374.2507 1374.3380 1378.4241 1378.5017 1425.0059 1426.4108 1433.6490 1433.8872 1470.0428 1470.1315 1475.0245 1475.0678 1484.1744 1484.2023 1485.2129 1485.4843 1500.9520 1501.0903 1755.4356 1757.2377 2977.7039 2977.9849 3011.8967 3012.1657 3025.7085 3025.7703 3027.9619 3028.1994 3058.9240 3058.9519 3085.4170 3085.4282 3123.6986 3123.7174 3202.1443 3202.1580 3593.4853 3593.4884
redmass: 19.7299 18.7142 19.6391 18.7490 12.5114 14.7527 10.6127 9.4705 9.5756 8.1135 7.4023 21.3831 22.4246 8.9854 7.7512 13.8584 7.7850 15.4126 17.0467 10.3616 8.0784 22.4705 10.2154 10.4409 9.4205 10.4278 14.2874 9.6620 17.4175 8.0878 11.8759 14.3125 8.6254 4.4893 4.0778 13.5163 12.6846 10.1973 4.5672 6.3855 10.5632 12.7525 20.9598 12.6582 6.6091 8.3954 15.8698 7.1576 5.8479 5.8541 15.9867 14.6832 6.8734 5.1283 6.0343 4.8298 3.3378 8.9353 15.9303 4.4531 5.8777 4.6237 6.6842 6.0872 15.2934 8.8084 5.3287 5.2392 9.5571 5.9161 8.3790 6.8950 10.4537 10.2846 3.2949 3.7439 3.5475 4.8454 2.5185 2.8071 1.8888 1.8942 16.3521 16.4970 19.9743 18.6009 17.8076 16.8790 2.9474 3.0650 14.8053 13.2751 5.3018 4.8306 13.7217 11.3688 4.3873 4.4221 6.3201 6.1176 16.4032 4.8949 4.8951 1.7621 1.7615 1.4026 1.4026 2.2895 2.2909 2.1296 2.1277 18.9993 18.8496 18.6863 18.6768 18.7639 16.7262 7.2264 6.4352 3.3723 3.4322 7.0368 8.3892 1.2305 1.2128 4.6189 4.9043 2.2818 2.2781 2.1998 2.2058 1.1400 1.1422 1.2409 1.2444 1.3502 1.3492 1.4765 1.4764 1.2122 1.2134 1.2448 1.2453 1.3552 1.3563 1.8446 1.8401 1.1565 1.1556 1.0834 1.0837 1.3776 1.3658 1.7228 1.7178 1.1195 1.1217 7.7965 7.8047 1.0551 1.0551 1.0568 1.0569 1.0902 1.0930 1.0756 1.0729 1.1039 1.1039 1.1001 1.1001 1.0597 1.0597 1.1074 1.1074 1.0745 1.0745
irintensity: 1.3970 0.0002 1.0697 0.0000 1.5704 0.0000 0.0000 1.5811 0.0000 2.0964 2.8437 0.0000 0.0002 0.0000 0.0000 3.1475 4.9519 3.2011 3.5416 2.2221 0.0000 0.7194 0.9104 0.0000 0.4489 1.2489 0.0000 0.0000 0.0000 0.0000 0.0000 0.0000 1.1234 0.2369 0.0000 1.4048 1.0217 2.2787 0.0001 9.7696 0.0003 1.9685 0.0000 0.0001 5.0600 2.2420 0.0003 4.7004 0.0000 0.0001 0.0008 71.7578 0.0000 28.7982 34.1006 45.4458 0.0001 0.0002 0.0000 16.3530 0.2531 0.0084 41.3604 32.7662 265.9421 0.0003 3.4591 0.0001 3.8326 0.0013 4.6502 11.2513 0.0002 86.9073 0.0001 0.0002 28.7677 31.3141 0.0000 20.5348 0.4306 23.7029 8.2688 7.1151 1.4322 0.0001 0.0002 0.0001 31.2392 0.0005 848.4350 968.1633 0.0027 271.1647 0.0009 0.0003 47.4396 0.0008 55.3918 0.0000 1639.8240 41.8940 0.0001 16.2465 0.2019 0.0000 0.1111 19.0141 0.0004 0.0025 4.0698 4.3361 741.7667 0.3514 717.8509 552.4446 0.0005 0.0003 9.5366 128.6251 0.0012 0.2874 93.7660 1.4377 0.0014 1000.8899 0.0008 0.8197 4.0385 15.4828 0.0806 0.0004 21.8444 77.3792 0.1190 1.2647 0.0014 0.2888 0.1993 0.0004 2.0507 0.0081 2.7034 94.6695 0.0000 207.3905 0.0031 36.0451 0.0006 9.6434 0.1744 0.0455 15.0008 197.4473 0.0010 42.5052 0.0243 1513.8717 0.0010 192.2782 0.0206 177.6928 0.0276 52.7316 1.7453 156.8130 0.3941 1.0557 52.9261 15.7685 31.4499 19.5337 0.0166 5.3034 0.9517 17.4651 30.1462
temp: 298.150 k
press: 1.00000 atm
elementType: 23 23 23 8 8 8 8 8 8 23 8 8 8 8 23 8 8 8 23 6 6 6 6 1 1 1 1 1 1 8 8 8 8 8 6 6 8 6 1 1 1 1 6 1 1 7 1 7 1 6 6 8 8 6 1 1 6 1 1 17 17
symmnumber: 1
zpe: 999639.2 jmol-1
zpe.correction: 0.380742 hartree
zpe.thermalcorrener: 0.423757 hartree
zpe.thermalcorrenthalpy: 0.424701 hartree
zpe.thermalcorrgfe: 0.308879 hartree
zpe.sumelectzpe: -8739.710300 hartree
zpe.sumelectthermal: -8739.667286 hartree
zpe.sumelectthermalent: -8739.666342 hartree
zpe.sumelectthermalfe: -8739.782164 hartree
dipole: -0.0011 0.0005 0.0006
dipole: 0.0013
quadrupole: -509.1266 -378.9101 -371.0580
quadrupole: 1.1665 -10.1152 -4.2033
quadrupole: -89.4283 40.7881 48.6402 1.1665 -10.1152 -4.2033
hfenergy: -8740.0910428 hartree
pointgroup: C01 [X(C12H18Cl2N2O21V6)]
dipole: 0.0003125 -0.000333 0.000264 debye
polarizability: 549.7115841|-114.3064386|447.5872825|-2.1413871|-7.7847865|350.8582434 unknown
InChI: InChI=1S/2C6H9ClNO4.13O.6V/c2*7-1-5(12)8-6(2-9,3-10)4-11;;;;;;;;;;;;;;;;;;;/h2*8H,1-4H2;;;;;;;;;;;;;;;;;;;
charge -2 multiplicity 1
61 atoms
V  -2.09666408 -0.57756081 -0.59023633
V  0.54010755 -1.10587764 -1.90170287
V  -0.13115738 -1.78950463 1.30911939
O  -0.01035097 0.00892602 -0.03175592
O  -3.63987123 -0.66550999 -0.92696957
O  -1.81788308 1.19586603 -1.53332089
O  -1.76155216 -1.88112933 0.59434658
O  -2.33861638 0.66873979 1.00373296
O  -1.23939342 -1.35187762 -1.94393637
V  0.11080424 1.8069584 -1.37190968
O  0.60407402 -2.53354193 -0.43797386
O  2.31831925 -0.65091716 -1.06631439
O  0.51060528 0.54228598 -2.57898674
O  1.12651558 -2.03508851 -3.03400019
V  2.07658983 0.59536194 0.52737348
O  -0.62438099 2.55126263 0.37540352
O  1.74117238 1.8989439 -0.65706341
O  -0.08312375 3.14206158 -2.19139866
V  -0.56061416 1.12377855 1.83901351
C  -1.70849495 3.41208981 0.33658557
C  -2.83104055 2.14424025 -1.49034196
C  -3.33928288 1.6354081 0.95743168
C  -3.01744735 2.71672956 -0.08009834
H  -3.75748215 1.67830204 -1.84333754
H  -2.58336023 2.97586347 -2.16190322
H  -1.50487166 4.21581248 -0.38640104
H  -1.8579438 3.85247866 1.3323675
H  -3.42855514 2.11982292 1.93692946
H  -4.28649629 1.13782474 0.73329858
O  1.79742989 -1.17796447 1.47059563
O  -0.53077489 -0.52454271 2.51588511
O  0.06255465 -3.12446964 2.12883979
O  1.21894248 1.36941605 1.88093427
O  -1.14671856 2.05275674 2.9716191
C  1.68821671 -3.39433383 -0.39920528
C  2.81062352 -2.12633814 1.42767897
O  3.61971515 0.68358167 0.86430093
C  2.99712786 -2.69890937 0.01747819
H  1.48464805 -4.19809945 0.32375041
H  1.8376464 -3.83466309 -1.39501313
H  3.73703484 -1.66036297 1.7807043
H  2.56294451 -2.95793224 2.09927846
C  3.31895403 -1.61762163 -1.02008975
H  3.40810928 -2.10203784 -1.99959428
H  4.26621845 -1.12009311 -0.79604483
N  3.99726286 -3.75770128 0.02264039
H  3.63988063 -4.69026454 -0.12956732
N  -4.01755874 3.77555144 -0.08517405
H  -3.66012788 4.70811338 0.06692765
C  5.31106694 -3.78080641 0.32464998
C  -5.33132472 3.79869026 -0.3873313
O  5.94010673 -4.82623843 0.37292103
O  -5.96033996 4.84413298 -0.43574944
C  6.02515017 -2.47079967 0.6094909
H  5.37951036 -1.60825387 0.7297035
H  6.63277317 -2.61451287 1.49959867
C  -6.04545153 2.48866223 -0.67195177
H  -6.65331289 2.63233242 -1.56190104
H  -5.39981589 1.62612775 -0.79228928
Cl 7.1431482 -2.10040749 -0.72902732
Cl -7.16308992 2.11830561 0.66688688
