program: Gaussian 16
title: Title
version: ES64L-G16RevC.02
method: RB3LYP
basis: def2TZVPP
operation: Freq
keyword: #N
keyword: Geom=AllCheck
keyword: Guess=TCheck
keyword: SCRF=Check
keyword: GenChk
keyword: RB3LYP/def2TZVPP
keyword: Freq
converged: YES YES NO NO
title: Mulliken charges:
elementType: V V V O O O O O O V O O O O V O O O V C C C C H H H H H H O O O O O C C O C H H H H C H H N H N H C C O O C H H C H H Cl Cl
charge: 0.893655 0.840595 0.848938 -1.011615 -0.451351 -0.339236 -0.402162 -0.341666 -0.402104 0.848872 -0.346034 -0.341666 -0.398593 -0.430071 0.893651 -0.346045 -0.402155 -0.432187 0.840639 0.005380 0.010712 0.027251 0.247758 0.080767 0.076273 0.079719 0.091890 0.080252 0.096938 -0.339236 -0.398605 -0.432158 -0.402151 -0.430104 0.005361 0.010690 -0.451328 0.247802 0.079705 0.091881 0.080766 0.076273 0.027264 0.080251 0.096931 -0.232597 0.124252 -0.232586 0.124252 0.206247 0.206265 -0.393505 -0.393509 -0.101594 0.122357 0.133691 -0.101611 0.133694 0.122367 -0.189735 -0.189735
chargesum: -2.00000
title: Mulliken charges with hydrogens summed into heavy atoms:
elementType: V V V O O O O O O V O O O O V O O O V C C C C O O O O O C C O C C N N C C O O C C Cl Cl
charge: 0.893655 0.840595 0.848938 -1.011615 -0.451351 -0.339236 -0.402162 -0.341666 -0.402104 0.848872 -0.346034 -0.341666 -0.398593 -0.430071 0.893651 -0.346045 -0.402155 -0.432187 0.840639 0.176989 0.167753 0.204441 0.247758 -0.339236 -0.398605 -0.432158 -0.402151 -0.430104 0.176946 0.167730 -0.451328 0.247802 0.204446 -0.108345 -0.108334 0.206247 0.206265 -0.393505 -0.393509 0.154454 0.154450 -0.189735 -0.189735
polarizability: 6.39008312e+02 1.77838731e+01 3.86439399e+02 1.21984196e+00 -1.86071228e+00 3.57305485e+02
1716.lowfreq: -3.5316 0.0028 0.0044 0.0047 0.9688 2.3047 23.1978 27.2093 33.5052
frequency: 23.1978 27.2084 33.5052 42.8505 43.9660 58.3194 72.5964 86.7990 102.7169 125.7483 139.5320 140.1503 140.8775 158.6826 163.8588 164.6323 168.4069 178.1051 180.7518 185.7994 190.9475 193.7369 203.2052 204.9303 209.8569 219.1005 224.2615 226.8651 228.0452 229.4816 232.9346 238.5930 241.3939 243.3020 245.0074 245.3099 252.4110 259.7920 271.6590 276.2975 277.4995 280.4128 285.9282 292.8806 302.3540 314.7657 315.7351 324.9818 330.9535 334.2952 338.6107 347.0169 376.9185 380.4974 386.8883 390.5228 392.8516 397.9105 406.4154 432.7051 433.9226 436.7747 438.7443 440.9929 441.4344 446.7383 447.8151 450.6930 454.4036 457.1870 465.0366 466.6326 470.8104 480.3815 494.9762 500.8849 507.6740 513.7664 522.4423 524.2097 578.7046 578.8298 623.4639 626.1330 627.1740 643.3958 645.3885 653.2174 666.0010 666.8014 706.2015 707.8352 746.4083 746.8666 756.1182 758.1190 792.4856 792.7466 805.3067 805.8262 835.4030 894.2485 894.3801 941.9295 941.9744 968.4234 968.5615 981.4213 981.4522 994.4264 994.4842 1015.6609 1016.1751 1023.0233 1024.5952 1026.7555 1058.9883 1090.9627 1092.4892 1104.6157 1105.8373 1114.1368 1116.8462 1153.6399 1159.8383 1173.3498 1174.1705 1208.1265 1208.1881 1215.7577 1215.7775 1275.5162 1275.7408 1290.7538 1290.8166 1336.0195 1336.0423 1337.0588 1337.0745 1380.7542 1380.8143 1384.4084 1384.4756 1416.1870 1416.9260 1428.3931 1429.2823 1474.3260 1474.3326 1481.9371 1481.9880 1488.1593 1488.1796 1495.5341 1495.6319 1512.4788 1512.5743 1716.7313 1718.4875 2973.5450 2973.7960 3007.2529 3007.5237 3017.8474 3017.8826 3024.1007 3024.3833 3049.5666 3049.5851 3087.3187 3087.3414 3118.2785 3118.2963 3197.5569 3197.5670 3560.2199 3560.2245
redmass: 18.9139 17.8806 19.8387 12.4116 15.7231 11.4708 9.9117 10.2315 14.6078 8.3225 22.6886 23.4025 8.0377 8.8271 7.9772 15.1553 11.1290 11.2607 13.3342 8.9793 8.2379 21.1985 10.8356 10.2004 10.6662 10.1004 13.5517 14.2413 12.1004 7.6781 12.6184 14.5450 11.6354 4.0517 12.2233 4.0932 13.2124 11.0749 8.4085 8.0784 7.7601 11.5236 11.6177 10.9700 6.3797 8.0149 16.1517 6.5709 5.7050 12.9810 5.9310 14.7616 7.9658 8.2891 5.9896 3.6798 7.8177 3.3917 15.5118 10.1323 9.3315 10.1285 6.7816 5.5541 4.5683 7.8414 6.6547 5.8594 6.7997 5.0015 5.5656 6.9806 9.4596 10.1972 3.3196 3.5485 3.7011 4.5877 2.5312 2.7450 2.2120 2.2177 16.4282 16.4578 17.0446 19.4603 18.2187 16.2381 2.4818 2.5286 15.0391 14.5023 4.8205 4.8207 14.7755 14.3211 4.9078 4.9481 5.6795 5.5710 16.8359 5.3058 5.3028 1.7622 1.7620 1.4417 1.4420 2.3771 2.3779 2.1914 2.1887 19.0006 18.8295 18.1864 18.7568 18.3615 17.0342 9.7068 9.6720 9.3201 9.3405 3.5231 3.4465 5.5715 4.8500 1.1582 1.2076 2.4111 2.4085 2.4578 2.4537 1.1254 1.1272 1.2147 1.2163 1.2971 1.2967 1.3379 1.3376 1.2069 1.2081 1.2247 1.2259 2.8378 2.8675 1.3051 1.3011 1.6175 1.6157 1.1261 1.1245 1.0812 1.0813 1.1007 1.1011 1.1033 1.1036 6.8384 6.8551 1.0554 1.0554 1.0569 1.0570 1.1028 1.1026 1.0664 1.0663 1.1042 1.1043 1.0971 1.0971 1.0604 1.0604 1.1069 1.1069 1.0745 1.0745
irintensity: 1.3659 0.0000 0.9296 1.6599 0.0000 0.0000 1.8950 0.0000 0.0000 2.3494 0.0000 0.0002 3.3953 0.0000 0.0000 1.0031 0.5528 6.5704 6.4757 1.4596 0.0000 1.5701 1.0621 0.0000 0.1711 1.3513 0.0000 0.0000 0.0000 0.0000 0.0000 0.0000 1.8455 0.2791 2.0218 0.0002 1.2789 1.5555 0.0000 0.0000 8.7895 3.6270 0.0000 0.0000 5.3878 4.2336 0.0000 3.8791 0.0000 0.0001 0.0000 81.2267 0.0000 52.7230 29.0571 25.9933 0.0000 0.0000 0.0000 38.2630 0.0004 214.3121 43.0064 27.9239 0.0024 0.0002 36.7665 0.0001 2.7203 0.0000 6.7113 12.8797 0.0001 79.6345 0.0000 0.0000 30.5041 26.9584 0.0000 12.5416 0.0065 27.2056 71.4154 67.4102 56.9636 0.0000 0.0000 0.0001 61.6953 0.0000 680.7427 801.5703 280.6365 0.0006 0.0000 0.0001 31.0235 0.0000 4.0163 0.0000 1510.0568 55.9168 0.0000 20.4030 0.0360 0.0000 0.5055 27.9216 0.1266 0.0017 8.2773 0.0744 706.7813 0.0125 678.2960 535.6123 0.0001 0.0003 17.6465 0.0023 16.9743 312.7728 0.0013 713.5524 0.0027 176.2901 0.0053 0.0006 4.2933 0.1551 16.3182 0.0014 23.2992 73.0288 0.3937 0.3240 0.0011 0.0230 0.9462 0.0012 1.1589 0.0524 11.1343 407.4338 0.0002 32.3455 0.0003 20.2875 29.7856 15.0455 0.0179 6.6929 0.2553 30.8492 0.0242 24.5017 0.0025 1473.1421 0.0097 182.0405 0.3753 176.2729 0.1147 3.4218 24.6825 169.2210 0.0002 0.9377 56.9858 30.9823 17.4710 24.3358 0.3189 4.2775 0.2329 2.6041 40.1338
temp: 298.150 k
press: 1.00000 atm
elementType: 23 23 23 8 8 8 8 8 8 23 8 8 8 8 23 8 8 8 23 6 6 6 6 1 1 1 1 1 1 8 8 8 8 8 6 6 8 6 1 1 1 1 6 1 1 7 1 7 1 6 6 8 8 6 1 1 6 1 1 17 17
symmnumber: 1
zpe: 992398.5 jmol-1
zpe.correction: 0.377985 hartree
zpe.thermalcorrener: 0.421342 hartree
zpe.thermalcorrenthalpy: 0.422286 hartree
zpe.thermalcorrgfe: 0.306776 hartree
zpe.sumelectzpe: -8743.871883 hartree
zpe.sumelectthermal: -8743.828526 hartree
zpe.sumelectthermalent: -8743.827582 hartree
zpe.sumelectthermalfe: -8743.943092 hartree
dipole: -0.0003 -0.0004 -0.0004
dipole: 0.0006
quadrupole: -511.0944 -383.4837 -374.9237
quadrupole: -1.2676 -9.6884 4.5086
quadrupole: -87.9271 39.6836 48.2436 -1.2676 -9.6884 4.5086
hfenergy: -8744.2498681 hartree
pointgroup: C01 [X(C12H18Cl2N2O21V6)]
dipole: -0.0000047 0.0002187 0.0000928 debye
polarizability: 562.8072211|-118.2717772|459.5222459|-2.1466541|-9.3033518|360.4237292 unknown
InChI: InChI=1S/2C6H9ClNO4.13O.6V/c2*7-1-5(12)8-6(2-9,3-10)4-11;;;;;;;;;;;;;;;;;;;/h2*8H,1-4H2;;;;;;;;;;;;;;;;;;;
charge -2 multiplicity 1
61 atoms
V  -2.10871139 -0.57242561 -0.62581541
V  0.56784228 -1.09461683 -1.92122546
V  -0.14596381 -1.82016906 1.29636041
O  -0.01016382 0.00877564 -0.03137328
O  -3.66596992 -0.66600987 -0.96220443
O  -1.82842002 1.20856426 -1.54635172
O  -1.77640988 -1.88650034 0.60051532
O  -2.35864623 0.67616807 1.00513089
O  -1.24401554 -1.36508174 -1.95280139
V  0.12560521 1.83802571 -1.35911216
O  0.61097803 -2.55228885 -0.44144873
O  2.33835542 -0.65841072 -1.06776287
O  0.50947575 0.54549776 -2.5940452
O  1.15206981 -2.03567821 -3.06429701
V  2.08831275 0.59013511 0.56321658
O  -0.63126973 2.56990136 0.3787637
O  1.75602593 1.90412841 -0.66315645
O  -0.06686642 3.18093322 -2.1930538
V  -0.58819518 1.1123858 1.85874073
C  -1.72087857 3.43841072 0.33942735
C  -2.84703717 2.16395277 -1.50195623
C  -3.36477082 1.65064405 0.95425475
C  -3.03285387 2.73747693 -0.08440897
H  -3.77176413 1.6995506 -1.85221106
H  -2.59617725 2.99110894 -2.17309156
H  -1.51276096 4.24157562 -0.37841618
H  -1.86821674 3.87281315 1.33462441
H  -3.46104696 2.12899073 1.93279255
H  -4.30440956 1.15176584 0.71992442
O  1.80813483 -1.19080289 1.48370916
O  -0.52996912 -0.52775811 2.53141104
O  0.04667262 -3.16305927 2.13029897
O  1.22360511 1.38283586 1.8902266
O  -1.17254396 2.05341051 3.00176525
C  1.7006187 -3.42072489 -0.40208878
C  2.82673428 -2.14620412 1.43929255
O  3.64556022 0.68380299 0.89959857
C  3.01256356 -2.71972238 0.02174449
H  1.49254229 -4.22388413 0.31577621
H  1.84798953 -3.85513925 -1.39727833
H  3.75146644 -1.68182459 1.78956624
H  2.57584215 -2.97336648 2.11040425
C  3.34446556 -1.63289688 -1.01692951
H  3.44069202 -2.11124689 -1.99546986
H  4.28413126 -1.1340448 -0.78263148
N  4.02448412 -3.78250361 0.03292984
H  3.66610113 -4.71892049 -0.09360168
N  -4.04471033 3.80032512 -0.09556938
H  -3.68625471 4.73670715 0.03101471
C  5.33939384 -3.80056976 0.35230221
C  -5.35962666 3.81853816 -0.41491603
O  5.96637228 -4.84977329 0.43762974
O  -5.98646921 4.86782437 -0.50023924
C  6.06221527 -2.48301771 0.59828593
H  5.42457048 -1.62328216 0.74997504
H  6.72696136 -2.62089461 1.44419516
C  -6.08260926 2.50109704 -0.6610207
H  -6.74730725 2.63912572 -1.50694229
H  -5.44507386 1.64128809 -0.81274887
Cl 7.10965371 -2.10005192 -0.82269367
Cl -7.13016832 2.11817643 0.75988166
