program: Gaussian 16
title: Title
version: ES64L-G16RevC.02
frameworkgroup: C1[X(C12H18Cl2N2O21V6)]
method: UM062X
basis: def2TZVPP
operation: Freq
keyword: #P
keyword: Geom=AllCheck
keyword: Guess=TCheck
keyword: SCRF=Check
keyword: GenChk
keyword: UM062X/def2TZVPP
keyword: Freq
converged: YES YES NO YES
polarizability: 6.19987426e+02 2.25105469e+01 3.61676623e+02 6.88095296e+00 -3.46727199e+00 3.36580660e+02
1716.lowfreq: -9.4684 -6.0025 0.0013 0.0014 0.0044 3.2677 26.4836 32.4931 34.2187
frequency: 26.4821 32.4431 34.2036 45.4594 50.2236 61.1741 83.8334 88.7341 98.3334 118.8926 136.5481 145.3186 150.1529 158.3808 164.9053 172.2938 176.5299 182.9968 187.6722 190.8896 194.4782 196.2995 202.6849 209.0823 217.2161 224.0871 231.2053 233.1561 236.2396 240.1203 242.5749 244.9206 246.6948 248.8212 259.0438 261.9635 265.5960 267.1414 268.6666 285.5713 291.8139 292.5982 297.7357 301.7703 311.0937 322.4436 327.1838 328.6923 336.7366 342.4840 349.3808 356.7812 363.0898 368.6737 383.1121 390.0365 393.7704 399.8382 406.1485 413.2073 425.8234 431.8328 445.1730 449.1281 452.4017 455.0567 458.2333 463.6787 467.1775 473.3418 475.9900 479.8560 488.5543 494.8329 497.8936 512.2431 522.3366 528.5879 533.6409 541.7941 551.6210 581.6010 620.8930 652.7186 662.1549 672.2624 675.4742 681.7447 683.2779 685.4250 704.9100 710.3241 745.7034 765.6267 768.7605 791.8363 809.3093 818.7794 826.1877 828.5465 829.9972 883.1908 898.4401 912.2964 921.2411 938.6712 951.9481 956.8923 969.9168 999.5658 1012.1259 1055.6769 1091.2170 1103.2932 1110.8491 1113.2009 1117.9066 1125.9353 1132.5581 1136.8726 1139.9925 1161.9806 1163.2293 1185.5948 1189.8703 1191.9292 1214.0627 1229.1000 1234.4154 1243.8372 1259.4220 1276.9272 1287.0116 1296.0148 1301.3598 1302.1763 1324.7679 1347.0774 1351.7228 1353.4419 1375.4299 1387.5670 1394.4734 1396.9835 1422.7782 1428.5460 1446.6968 1465.9675 1481.3611 1489.2738 1497.7784 1501.9255 1502.7655 1506.1271 1506.3286 1513.2693 1524.8799 1787.3401 1808.7333 3003.3408 3020.0206 3020.5011 3029.8600 3049.9205 3052.4869 3066.4149 3073.3985 3101.4415 3121.4015 3134.4248 3134.7281 3148.0959 3154.9284 3205.1379 3215.4688 3553.2678 3588.6678
redmass: 16.6411 15.0467 17.1676 12.4076 12.0569 14.1868 13.4891 13.9521 13.5707 9.5442 16.8938 15.7839 10.9029 11.1213 7.2293 11.1296 9.8402 14.4279 10.6352 10.0772 8.4765 9.6956 8.2508 20.7306 9.4790 10.2903 13.4652 13.7775 14.9040 14.0518 11.3708 6.7618 8.8900 10.2143 10.1127 3.9433 14.3510 11.8943 16.0441 8.4645 10.3351 5.7660 14.6279 13.4870 4.8575 9.7202 12.3078 8.6508 5.9533 6.9494 10.3620 12.2870 4.6708 4.4132 8.1234 7.8619 16.0091 5.2602 5.1912 8.1346 4.9152 6.5586 5.4565 4.9227 3.8506 8.0406 8.2460 9.4035 8.7868 5.9038 5.4233 6.3228 8.5634 6.3767 4.3717 5.3283 3.6974 4.8034 2.6154 3.4200 6.4533 1.5885 2.3363 13.1159 15.3639 17.7845 19.3739 5.7173 15.6580 9.3506 3.3262 4.8504 15.4293 5.1346 5.1381 13.9270 14.2984 4.2498 4.4649 6.6121 5.5656 17.1857 3.9612 4.9366 1.3116 1.7043 1.6975 1.6969 1.3872 2.2203 2.0637 1.7971 18.6096 15.4187 3.9310 9.6573 12.3908 11.5737 12.8705 15.9765 4.0303 3.0549 2.4510 1.3559 2.3545 4.1991 2.8435 2.9914 2.3167 2.1762 1.9380 1.4409 1.1638 1.2253 1.2083 1.2631 1.1226 2.2006 1.3272 1.4656 1.8439 1.2244 1.2991 1.7050 1.2918 2.3209 1.3991 1.0875 1.0965 1.1507 1.1648 1.7874 1.0802 1.0934 1.2025 1.5147 1.0986 8.1246 8.6375 1.0547 1.0581 1.0685 1.0466 1.1054 1.0585 1.0654 1.1044 1.1045 1.1121 1.0950 1.0652 1.0619 1.0839 1.1099 1.1095 1.0748 1.0751
irintensity: 1.9782 0.1386 0.8198 0.9457 0.2067 0.0179 1.6274 0.9648 0.3243 3.9228 0.4020 1.9292 1.7865 0.8168 0.6335 4.4940 4.3561 4.4912 4.8520 1.8050 1.9117 2.4278 0.4392 0.2085 0.0780 2.3503 1.2830 0.9639 0.1778 0.5178 0.1409 0.8731 0.4389 0.9214 1.2571 0.1046 2.8284 0.7429 1.7993 3.9918 0.8436 2.5119 1.0973 4.5716 9.6434 40.8064 7.5101 15.4725 0.4352 18.4629 60.4039 4.1096 3.1007 3.2429 96.1044 39.2166 0.4959 33.8236 6.9441 20.1087 13.4341 2.2904 4.7222 104.8481 2.3329 207.3872 29.9772 61.3193 50.1927 6.3860 22.4562 10.8521 27.7415 32.4207 11.6969 9.3926 29.0872 21.2206 10.4565 8.2239 89.8060 17.6185 9.9166 96.4562 2.3327 113.9382 6.8670 86.0026 83.1266 136.2425 250.4300 619.5423 676.7462 124.4866 204.8233 27.6878 50.8929 19.7577 8.3434 6.6600 4.7484 2191.1874 1.2353 11.2209 4.6903 2.8648 7.0449 14.5619 0.1129 7.6437 0.5462 35.4215 285.9386 354.1951 107.5254 27.9500 649.6883 145.1071 203.5808 249.8796 110.2382 101.6289 17.6261 226.7652 189.3886 481.2027 150.2518 37.5169 3.6602 11.7511 92.5773 44.0740 14.3578 54.9350 26.0331 3.0819 0.4294 128.9945 0.2964 0.4780 274.9002 0.3947 9.8745 213.7183 24.0741 234.4429 11.2946 3.9085 1.7665 36.6809 50.3136 60.4146 3.4158 31.4157 25.4565 86.3177 9.5118 768.9394 581.8939 38.0055 65.9445 21.0162 23.1366 4.8994 47.4656 39.4100 12.4357 15.1829 4.0332 7.3174 5.0068 7.0671 16.3524 0.4188 0.3766 42.9068 27.4208
temp: 298.150 k
press: 1.00000 atm
elementType: 23 23 23 8 8 8 8 8 8 23 8 8 8 8 23 8 8 8 23 6 6 6 6 1 1 1 1 1 1 8 8 8 8 8 6 6 8 6 1 1 1 1 6 1 1 7 1 7 1 6 6 8 8 6 1 1 6 1 1 17 17
symmnumber: 1
zpe: 1006776.1 jmol-1
zpe.correction: 0.383461 hartree
zpe.thermalcorrener: 0.426069 hartree
zpe.thermalcorrenthalpy: 0.427013 hartree
zpe.thermalcorrgfe: 0.312885 hartree
zpe.sumelectzpe: -8742.081558 hartree
zpe.sumelectthermal: -8742.038950 hartree
zpe.sumelectthermalent: -8742.038005 hartree
zpe.sumelectthermalfe: -8742.152133 hartree
dipole: 5.7683 0.5275 0.0207
dipole: 5.7924
quadrupole: -404.1517 -362.3390 -355.1726
quadrupole: 3.0306 -11.6238 4.0187
quadrupole: -30.2640 11.5488 18.7152 3.0306 -11.6238 4.0187
hfenergy: -8742.465019 hartree
pointgroup: C01 [X(C12H18Cl2N2O21V6)]
dipole: -2.2676539 0.2262619 -0.0067991 debye
polarizability: 619.4334934|-25.5704751|360.6575878|7.1651117|6.4465885|338.1536286 unknown
InChI: InChI=1S/2C6H9ClNO4.13O.6V/c2*7-1-5(12)8-6(2-9,3-10)4-11;;;;;;;;;;;;;;;;;;;/h2*8H,1-4H2;;;;;;;;;;;;;;;;;;;
charge -1 multiplicity 2
61 atoms
V  1.58026934 1.33492036 -0.97692161
V  -1.03799116 0.20814882 -1.95768627
V  -0.66723364 2.00134553 0.86347707
O  -0.05408024 0.01210726 0.0269639
O  2.83412492 2.03403214 -1.55964196
O  2.14835807 -0.5475453 -1.44741258
O  0.65818686 2.6272728 -0.07476794
O  2.36947971 0.80278094 0.79398907
O  0.37789924 1.22502507 -2.30263975
V  0.80010763 -1.94152168 -0.91293649
O  -1.79945983 1.74824973 -0.81471364
O  -2.38727379 -0.77696171 -0.74315974
O  -0.24434458 -1.36835977 -2.23824779
O  -2.05483527 0.41790269 -3.11809662
V  -1.47788219 -1.45222189 0.94676326
O  1.78519059 -1.74478426 0.84811638
O  -0.58999676 -2.64604535 0.06203116
O  1.57967547 -3.16482239 -1.45021848
V  1.04859737 -0.20109182 1.9785374
C  3.16420327 -1.98369226 0.87338666
C  3.51314847 -0.86866901 -1.33474398
C  3.73127774 0.44802083 0.84154797
C  3.96772781 -0.89478624 0.13277591
H  4.08491312 -0.13585794 -1.90835454
H  3.68637147 -1.85866141 -1.76703549
H  3.36753144 -2.95009187 0.39614022
H  3.5047012 -2.0193997 1.91377625
H  4.04623192 0.34997339 1.88410045
H  4.30674848 1.25299862 0.38500195
O  -2.2067321 0.55549686 1.43869961
O  0.21656688 1.37252672 2.26330569
O  -1.53011568 3.19144764 1.39455544
O  -0.3871446 -1.22544782 2.32786719
O  2.01579543 -0.40086287 3.17304452
C  -3.1502018 2.01249497 -0.83928496
C  -3.47960602 0.85961317 1.45404222
O  -2.78804878 -2.09398618 1.51919873
C  -4.01108419 0.91539806 -0.18144073
H  -3.3559243 2.96374752 -0.33154222
H  -3.49584319 2.08005889 -1.87975153
H  -4.10720773 0.081645 1.89728655
H  -3.6857221 1.8790054 1.79222809
C  -3.73101577 -0.4779733 -0.77934263
H  -4.07911378 -0.4161599 -1.81932629
H  -4.28762834 -1.26311273 -0.27230946
N  -5.34982875 1.35562814 -0.186701
H  -5.47728274 2.34767804 -0.35387119
N  5.35926777 -1.32418119 0.22738311
H  5.50615096 -2.26246853 0.57532875
C  -6.53273711 0.79775847 0.25508881
C  6.52068162 -0.79271971 -0.2388969
O  -7.52167142 1.48559262 0.33568611
O  7.56112734 -1.4166103 -0.19794225
C  -6.60167233 -0.67504062 0.60904239
H  -5.70041016 -1.0759408 1.06194059
H  -7.44911081 -0.80161855 1.27292716
C  6.53163646 0.62784739 -0.78423393
H  7.2890015 0.67170262 -1.55898755
H  5.58067383 0.98773283 -1.15830262
Cl -6.93563067 -1.60191823 -0.87384503
Cl 7.04222591 1.73435682 0.5187676
