program: Gaussian 16
title: Title Card Required
version: ES64L-G16RevC.02
method: UB3LYP
basis: def2TZVPP
operation: Freq
keyword: #P
keyword: Geom=AllCheck
keyword: Guess=TCheck
keyword: SCRF=Check
keyword: GenChk
keyword: UB3LYP/def2TZVPP
keyword: Freq
converged: YES YES NO YES
polarizability: 6.00740931e+02 1.84936719e+01 3.24783443e+02 2.83458824e-01 3.94952994e-02 3.46397410e+02
1716.lowfreq: -0.0037 -0.0036 -0.0018 2.6076 3.4515 4.1633 33.1288 72.1929 73.3148
frequency: 33.1256 72.1929 73.3148 90.1062 102.5260 110.3798 126.3457 136.9438 138.4905 148.7784 149.8701 157.5007 169.1046 170.2235 180.5063 184.3837 186.7617 187.6864 193.4616 195.7668 203.0354 205.7132 206.4771 215.4555 222.9069 224.4713 228.7304 231.1846 233.5832 237.1782 243.8641 249.9955 253.0524 257.0033 272.9134 277.6562 285.1765 288.1407 291.6506 293.2582 296.1089 303.1651 312.3600 322.1689 334.8933 338.2785 345.0621 373.6927 374.0772 386.1866 387.8821 389.6883 389.9308 393.3109 395.6908 416.9609 418.5627 428.6874 435.7096 441.2648 443.9864 448.5715 450.1440 450.4754 457.8317 469.0788 473.0532 476.4141 502.1465 503.3855 504.5948 509.0468 586.2699 597.2224 622.4282 627.4755 636.7469 637.5564 645.5340 650.5011 652.4542 688.0481 748.0362 749.3322 789.4891 801.3351 802.1899 914.4564 914.8699 967.0413 967.1152 974.5438 975.4226 1020.0629 1020.5494 1027.7995 1028.2553 1040.2468 1043.3890 1046.6152 1050.1675 1053.4693 1054.6376 1057.2213 1059.5293 1062.5193 1067.2909 1089.5100 1090.9762 1143.0599 1144.5059 1168.5024 1170.2333 1205.1336 1207.6888 1254.1035 1254.6575 1273.9432 1274.1234 1278.0856 1278.4257 1340.1673 1341.1199 1358.2763 1359.8509 1373.9247 1374.3706 1378.3963 1379.1217 1423.0901 1423.4586 1450.4376 1450.5136 1488.1215 1490.0644 1492.0662 1493.4002 1506.9242 1507.7506 1519.5650 1519.7606 2972.9552 2973.0599 3002.9939 3003.2241 3003.9688 3004.1911 3019.4132 3019.7219 3026.0361 3026.4875 3049.9945 3050.2238 3080.7974 3081.3491 3086.1983 3086.6224 3851.4587 3851.5267
redmass: 18.6092 7.9223 7.4172 6.9718 6.8900 17.4607 5.8644 5.0928 21.9798 6.5186 20.9148 8.4971 7.1982 15.1539 4.2683 3.4002 1.5598 1.4751 7.6763 5.3618 17.1015 19.2149 12.0472 11.8614 4.8631 11.4361 4.5558 10.2786 3.8595 5.8072 10.9757 5.1679 8.1513 14.0780 7.0629 7.2712 16.2330 20.6630 14.9210 17.4849 18.2303 9.9506 9.6697 7.2238 16.3274 6.4150 5.4371 7.7841 7.7572 7.4519 14.4306 4.3380 10.8430 4.6844 5.6578 2.7190 4.1839 6.3846 8.1765 5.2591 5.5515 8.5284 8.1693 7.7676 7.5214 10.8906 7.0832 6.7449 3.6870 3.4173 3.4029 3.8898 19.5750 18.3041 15.0379 18.4598 13.3752 17.8962 12.9847 4.1329 4.3947 14.6142 14.0300 14.1723 16.1859 4.0888 4.0787 2.0790 2.0756 1.4300 1.4240 2.3904 2.4193 2.6296 2.7163 7.0914 7.1046 15.0982 12.8956 16.7899 17.4403 11.9432 8.3444 6.1739 4.5405 4.1311 6.4007 7.6975 7.7742 3.5984 3.5891 1.7806 1.7717 1.8988 1.8606 1.2987 1.3034 1.0854 1.0864 1.0935 1.0953 1.3910 1.3957 1.4408 1.4569 1.1845 1.1847 1.1895 1.1901 1.3720 1.3729 1.3685 1.3687 1.0772 1.0759 1.0751 1.0739 1.0863 1.0863 1.0809 1.0813 1.0541 1.0541 1.0809 1.0879 1.0806 1.0728 1.0620 1.0620 1.0603 1.0603 1.1058 1.1060 1.1040 1.1040 1.1000 1.1001 1.0666 1.0666
irintensity: 0.0641 0.0270 0.1134 1.8506 3.1640 0.9110 4.3074 2.0016 0.1847 21.5100 0.0724 8.0989 1.8548 0.2606 21.6507 8.1704 70.0662 23.7948 0.5801 14.5772 0.0351 0.1575 0.2463 0.5304 0.7352 0.6536 0.3903 4.4904 0.0173 9.3080 2.3819 1.8457 0.6782 0.1918 0.2490 0.0341 1.2315 0.2843 0.3990 0.0203 2.9949 18.4420 0.3120 4.5969 15.2141 1.6639 1.1937 0.0237 0.0387 19.0419 0.3570 12.0066 17.8075 17.5152 8.7620 0.0659 23.0717 23.4081 0.0208 0.0118 0.0077 2.4618 2.2710 5.5875 9.9968 85.5690 3.3535 2.4295 7.7345 0.9680 23.2233 32.5300 15.4464 0.6654 10.9787 7.7879 67.8827 9.4013 243.0301 84.6642 14.5252 711.2777 0.2513 0.6694 493.6917 2.2432 0.9788 3.3263 1.5967 1.5415 0.2568 12.9176 0.3702 10.3433 7.6237 70.9114 35.9197 193.3480 87.2836 88.0379 291.3668 373.0452 0.0368 134.8283 12.0232 202.4902 6.4001 17.4436 50.7408 145.4213 37.5930 41.0653 1.2112 98.8971 8.3432 23.6252 65.9231 0.5382 0.2600 7.7646 0.0923 31.4884 12.3381 56.3145 0.9890 2.0572 0.5387 0.7275 0.8385 15.5263 1.3567 7.9170 0.1061 10.3163 2.7657 40.6058 0.9715 16.9978 0.0478 4.9630 0.0188 45.3109 43.7361 63.0887 16.9061 52.3721 48.3724 54.5136 27.6774 134.4174 13.6913 51.3595 2.4381 18.4188 2.1865 3.1654 6.3868 60.9283 22.6015
temp: 298.150 k
press: 1.00000 atm
elementType: 23 23 23 8 8 8 8 8 8 23 8 8 8 8 23 8 8 8 23 6 6 6 6 6 1 1 1 1 1 1 1 1 8 8 8 8 8 6 6 8 6 1 1 1 1 6 6 1 1 1 1 8 1 8 1
symmnumber: 1
zpe: 916188.2 jmol-1
zpe.correction: 0.348958 hartree
zpe.thermalcorrener: 0.387556 hartree
zpe.thermalcorrenthalpy: 0.388500 hartree
zpe.thermalcorrgfe: 0.285366 hartree
zpe.sumelectzpe: -7637.484656 hartree
zpe.sumelectthermal: -7637.446057 hartree
zpe.sumelectthermalent: -7637.445113 hartree
zpe.sumelectthermalfe: -7637.548248 hartree
dipole: 0.0038 -0.0119 -1.1082
dipole: 1.1082
quadrupole: -235.8813 -318.3721 -318.5216
quadrupole: 7.6424 -0.0653 -0.0278
quadrupole: 55.0437 -27.4471 -27.5966 7.6424 -0.0653 -0.0278
hfenergy: -7637.8336133 hartree
pointgroup: C01 [X(C10H18O21V6)]
dipole: -0.0016157 0.4359928 0.0042944 debye
polarizability: 600.9908364|0.3821463|346.3976834|16.5202764|0.0230809|324.5332644 unknown
InChI: InChI=1S/2C5H9O4.13O.6V/c2*6-1-5(2-7,3-8)4-9;;;;;;;;;;;;;;;;;;;/h2*6H,1-4H2;;;;;;;;;;;;;;;;;;;
charge -1 multiplicity 2
55 atoms
V  -1.11321006 0.06049027 -1.99097512
V  1.23409053 1.73050194 -0.97452174
V  1.2403163 -1.62087863 -0.99614604
O  -0.00086851 0.05439234 0.00036526
O  -2.12191592 0.06841559 -3.2090206
O  -2.14030541 1.35952376 -0.80213534
O  0.08600762 -1.2543893 -2.31586574
O  -2.1432653 -1.25363121 -0.81752714
O  0.08695657 1.37567756 -2.30561725
V  -1.23561802 1.71270671 1.00485886
O  2.24746191 0.05839904 -1.48232279
O  2.14006573 1.35132498 0.81903819
O  -0.0014289 2.59950887 0.01449569
O  2.25741364 2.81750875 -1.50213236
V  1.11344303 0.02743137 1.9915797
O  -2.24736245 0.03828282 1.48330836
O  -0.08515279 1.35219088 2.32074418
O  -2.26069884 2.7924885 1.54396908
V  -1.23933519 -1.63854166 0.96838284
C  -3.66085506 0.0381035 1.34895554
C  -3.54842876 1.30483801 -0.81997848
C  -3.55744199 -1.2019797 -0.83708924
C  -5.61186255 0.09510595 -0.21801765
C  -4.09353617 0.0476605 -0.12077364
H  -3.8807328 1.3174396 -1.86128759
H  -3.92778994 2.19673211 -0.31194011
H  -4.04807574 0.92742461 1.8540776
H  -4.05116864 -0.84981518 1.84591867
H  -3.93981161 -2.09678882 -0.34500314
H  -3.88644449 -1.1941763 -1.87916908
H  -5.97289346 1.01406172 0.25954975
H  -5.90096872 0.12732197 -1.27523814
O  2.14365263 -1.26188125 0.80241267
O  0.00127459 -2.50548052 -0.01318147
O  2.25563642 -2.70215207 -1.54194456
O  -0.0868356 -1.27877372 2.30221061
O  -2.25393593 -2.72657054 1.50215627
C  3.6608337 0.05767638 -1.34780153
C  3.55791457 -1.21048247 0.82210131
O  2.12152045 0.02261287 3.21008322
C  4.0935851 0.04837929 0.12193461
H  4.05243717 -0.8230366 -1.8564809
H  4.04695359 0.95413577 -1.84106243
H  3.88767039 -1.21649368 1.86398998
H  3.93965032 -2.09882355 0.31804916
C  3.54821483 1.29632379 0.83696834
C  5.6118965 0.09494232 0.21963186
H  3.92837353 2.19483512 0.34125006
H  3.87937586 1.29526857 1.87870624
H  5.90103677 0.11456647 1.27715658
H  5.972721 1.0196419 -0.2468955
O  -6.17525138 -1.05125242 0.41853497
H  -7.13025605 -1.00954694 0.33879758
O  6.17539873 -1.043603 -0.43063804
H  7.13028781 -1.00378727 -0.34863854
