program: Gaussian 16
title: Title Card Required
version: ES64L-G16RevC.02
method: RPBE1PBE
basis: def2TZVPP
operation: Freq
keyword: #N
keyword: Geom=AllCheck
keyword: Guess=TCheck
keyword: SCRF=Check
keyword: GenChk
keyword: RPBE1PBE/def2TZVPP
keyword: Freq
converged: YES YES NO YES
title: Mulliken charges:
elementType: V V V O O O O O O V O O O O V O O O V C C C C C H H H H H H H H O O O O O C C O C H H H H C C H H H H O H O H
charge: 0.659905 0.661867 0.655988 -0.908060 -0.412329 -0.247593 -0.342744 -0.246782 -0.344336 0.661889 -0.247634 -0.247419 -0.344466 -0.413161 0.660075 -0.247732 -0.344540 -0.413075 0.656424 0.002215 0.008080 0.000806 -0.143417 0.246340 0.061807 0.062889 0.052943 0.084075 0.083432 0.054281 0.064893 0.064875 -0.246745 -0.341320 -0.402454 -0.342890 -0.402723 0.001392 0.001716 -0.412314 0.246432 0.083181 0.053965 0.053198 0.084262 0.007953 -0.143408 0.061845 0.062899 0.064870 0.064887 -0.325419 0.158296 -0.325410 0.158290
chargesum: -2.00000
title: Mulliken charges with hydrogens summed into heavy atoms:
elementType: V V V O O O O O O V O O O O V O O O V C C C C C O O O O O C C O C C C O O
charge: 0.659905 0.661867 0.655988 -0.908060 -0.412329 -0.247593 -0.342744 -0.246782 -0.344336 0.661889 -0.247634 -0.247419 -0.344466 -0.413161 0.660075 -0.247732 -0.344540 -0.413075 0.656424 0.139233 0.132776 0.138520 -0.013649 0.246340 -0.246745 -0.341320 -0.402454 -0.342890 -0.402723 0.138539 0.139177 -0.412314 0.246432 0.132697 -0.013651 -0.167123 -0.167120
1716.lowfreq: -3.5961 -2.0817 -0.0027 -0.0018 0.0034 2.8281 67.2294 75.0680 76.4416
frequency: 67.2293 75.0680 76.4415 93.2302 105.3714 127.7400 132.5561 145.1112 145.3076 146.8725 151.0318 167.0659 170.9826 178.0655 182.6964 184.1428 185.8045 190.5932 200.4610 207.3023 209.6721 225.3800 228.8898 229.7568 230.8140 231.6177 232.0803 234.4621 241.4186 242.0949 245.5087 248.0842 253.1978 256.0937 268.6388 273.9748 284.3368 286.5145 294.3815 300.0258 320.5735 324.0495 332.3944 339.6455 342.9602 350.2560 383.3691 383.5131 387.3345 387.5134 391.2693 393.0612 408.6752 409.1661 413.1501 438.6502 444.1172 444.2315 445.7648 452.9172 453.4223 456.4494 456.7858 460.2841 461.3516 469.1024 480.6509 484.3635 499.9808 500.5413 515.0969 515.6450 637.1844 637.4081 638.1276 650.5772 655.8582 658.3502 661.3729 670.7446 716.4632 717.2495 768.7195 769.1202 815.7747 817.0002 851.9034 924.5280 924.5642 964.1152 964.2451 991.4984 991.5459 1033.4947 1033.5380 1041.1712 1042.5141 1044.5728 1047.6206 1048.8280 1058.4351 1059.6147 1083.8480 1117.7471 1118.0790 1120.1118 1122.8245 1150.8401 1152.6142 1175.7048 1178.9429 1186.0251 1189.3284 1217.6564 1217.6833 1260.7474 1260.7904 1274.2753 1274.4636 1279.5231 1279.6644 1353.1611 1353.1820 1365.3020 1365.3431 1375.3840 1375.3999 1376.4791 1376.5157 1426.8113 1428.3681 1443.3459 1443.3820 1471.5866 1471.6537 1476.5765 1476.5964 1493.4881 1493.5300 1504.8708 1504.9417 2966.3004 2966.3132 2981.3296 2981.6491 2994.3500 2994.3895 3000.2899 3001.0381 3001.4890 3001.6375 3024.2739 3024.3654 3066.4487 3066.6967 3069.0875 3069.2681 3908.4397 3908.4492
redmass: 10.2756 7.3082 11.0562 6.1646 5.9234 2.2187 1.5030 3.5551 8.0237 2.8728 3.8825 4.1360 5.4484 10.4692 6.2516 12.6925 14.7421 9.4212 20.7154 7.8873 9.8486 4.6112 8.5857 12.2313 9.0043 10.4005 10.2905 6.6946 4.4664 5.9741 11.6035 13.2875 9.4657 7.3043 8.3945 8.2380 18.4302 15.6703 10.4606 7.6998 8.3902 11.1205 8.0777 5.4784 6.6632 11.9361 6.0117 5.2655 6.2181 6.1430 7.7906 5.8209 2.8633 2.5381 14.8568 10.8011 9.1575 9.1120 10.1589 8.4348 8.4068 6.2387 7.1779 6.3571 6.7776 12.1832 4.9095 5.9327 3.7249 3.5967 4.9620 4.9364 15.6755 18.9888 16.0714 5.5743 6.5035 18.3520 6.6094 8.0737 15.5378 15.5857 14.6465 14.6566 4.0171 3.9763 16.7715 1.9539 1.9536 1.3934 1.3935 2.4165 2.4144 2.1156 2.0668 14.6129 7.9854 9.8259 17.8785 17.0026 5.8458 5.9169 16.5745 7.5733 7.2626 6.4847 6.0642 6.6626 6.0633 2.0238 1.7308 2.5638 3.4910 1.7399 1.7395 1.3033 1.3031 1.0879 1.0878 1.1044 1.1050 1.5247 1.5248 1.3002 1.3019 1.4497 1.4473 1.2532 1.2505 1.4289 1.4390 1.4383 1.4382 1.0769 1.0768 1.0745 1.0746 1.0959 1.0957 1.0832 1.0835 1.0539 1.0539 1.0549 1.0550 1.0666 1.0667 1.0655 1.0736 1.1003 1.0909 1.1053 1.1053 1.0985 1.0985 1.0976 1.0976 1.0664 1.0664
irintensity: 0.0545 0.1324 0.1522 3.6824 8.1404 45.7762 24.1046 29.6378 4.4356 40.2012 13.3875 0.7985 2.0722 0.0495 0.7963 1.2213 0.9295 3.9213 0.1876 0.0387 0.0346 0.0658 0.8522 0.6644 0.0167 0.4749 0.5655 4.5790 0.1495 0.0791 3.6394 4.2506 0.1837 0.1158 0.4891 0.7996 0.6241 0.0711 0.1990 1.9960 4.4229 0.0761 0.0663 0.3731 0.0552 50.3362 0.6898 2.1396 39.6435 33.4766 12.3468 6.8534 19.1606 6.1008 0.5912 0.4510 34.2699 72.1393 190.6131 0.4905 1.0917 41.0318 6.2489 6.5989 9.0147 2.4701 11.3895 39.1484 0.0254 0.2518 34.9062 34.4803 74.4388 35.0573 65.4243 3.4029 57.1677 0.4984 58.8991 7.1269 832.3234 826.9503 0.8900 1.2324 2.3160 1.2871 1481.1810 1.3018 3.2297 0.0104 0.0073 14.2903 0.2606 23.5894 62.3453 425.2886 32.1397 427.7719 470.4091 396.8625 8.2613 270.1591 14.0975 1.2401 39.9020 121.4450 0.5350 100.7153 62.6932 513.5182 15.4313 273.0828 2.7986 4.0349 8.1209 16.3891 42.8511 0.0191 0.1340 0.1280 0.1056 9.9951 10.5397 1.2652 3.7169 0.9065 1.2076 0.3082 0.1435 112.0005 1.1404 1.7097 0.2931 2.4559 2.0567 2.4759 2.8280 2.7970 0.0475 35.0363 0.0916 16.9880 27.4644 169.7151 88.2639 18.7406 40.8362 318.1236 18.0915 45.5450 66.3324 33.6226 54.1716 3.5119 1.2370 29.2770 29.5663 33.6042 1.5376
temp: 298.150 k
press: 1.00000 atm
elementType: 23 23 23 8 8 8 8 8 8 23 8 8 8 8 23 8 8 8 23 6 6 6 6 6 1 1 1 1 1 1 1 1 8 8 8 8 8 6 6 8 6 1 1 1 1 6 6 1 1 1 1 8 1 8 1
symmnumber: 1
zpe: 924683.7 jmol-1
zpe.correction: 0.352193 hartree
zpe.thermalcorrener: 0.389802 hartree
zpe.thermalcorrenthalpy: 0.390746 hartree
zpe.thermalcorrgfe: 0.290958 hartree
zpe.sumelectzpe: -7633.949616 hartree
zpe.sumelectthermal: -7633.912008 hartree
zpe.sumelectthermalent: -7633.911064 hartree
zpe.sumelectthermalfe: -7634.010852 hartree
dipole: 0.0018 1.0113 0.0169
dipole: 1.0114
quadrupole: -288.2068 -338.4412 -336.4986
quadrupole: -0.0639 6.5873 -0.0211
quadrupole: 32.8421 -17.3924 -15.4497 -0.0639 6.5873 -0.0211
hfenergy: -7634.3018099 hartree
pointgroup: C01 [X(C10H18O21V6)]
dipole: -0.0007445 0.3979136 -0.0040408 debye
polarizability: 503.6909397|0.0387463|321.0610474|4.6151368|0.0032006|319.9864142 unknown
InChI: InChI=1S/2C5H9O4.13O.6V/c2*6-1-5(2-7,3-8)4-9;;;;;;;;;;;;;;;;;;;/h2*6H,1-4H2;;;;;;;;;;;;;;;;;;;
charge -2 multiplicity 1
55 atoms
V  -1.0871215 0.07193801 -1.9618951
V  1.17195921 1.72595143 -0.89840736
V  1.18161589 -1.60721252 -0.95670666
O  0.00040619 0.04322154 -0.00029732
O  -2.10103152 0.07000271 -3.17642468
O  -2.13158825 1.3615159 -0.82244356
O  0.06570706 -1.28414441 -2.29315808
O  -2.13753342 -1.27286234 -0.83273723
O  0.07469217 1.36428046 -2.29488059
V  -1.17576117 1.68811694 0.9641082
O  2.20684932 0.04748688 -1.45220593
O  2.131078 1.35585493 0.83386124
O  -0.00541294 2.68867695 0.00009844
O  2.24106099 2.74957881 -1.45835575
V  1.08840332 -0.00177195 1.96225832
O  -2.20693341 0.03586495 1.45329925
O  -0.06484542 1.36490955 2.29536849
O  -2.24346289 2.71777822 1.51535759
V  -1.17969715 -1.64519292 0.89272615
C  -3.5999874 0.03484106 1.33713554
C  -3.52128069 1.29090747 -0.82389673
C  -3.53424706 -1.20962447 -0.83602349
C  -5.56384327 0.10541753 -0.20657546
C  -4.05534308 0.03820576 -0.12247039
H  -3.87240243 1.29452875 -1.86544606
H  -3.91568154 2.18116601 -0.3142939
H  -3.99513517 0.9302932 1.83650329
H  -3.99383705 -0.85479472 1.83826447
H  -3.93037488 -2.10278508 -0.34284182
H  -3.87954922 -1.19446908 -1.87887977
H  -5.9012209 1.03545526 0.27455855
H  -5.85486778 0.14948853 -1.26656975
O  2.13810554 -1.27841924 0.82407712
O  0.00556755 -2.60505679 0.00098852
O  2.24104471 -2.63823164 -1.51276606
O  -0.07635107 -1.28290629 2.29369456
O  -2.23857672 -2.67139168 1.45872326
C  3.59987634 0.04599576 -1.33635851
C  3.53475699 -1.21442802 0.82770865
O  2.10045043 0.00665357 3.17828086
C  4.055305 0.0387989 0.12323018
H  3.99731842 -0.83764001 -1.84546048
H  3.99137275 0.94741144 -1.82753968
H  3.88345105 -1.20920862 1.8696743
H  3.92816718 -2.10351094 0.32532293
C  3.52083841 1.28606261 0.83395313
C  5.56379106 0.10595598 0.20774993
H  3.91749001 2.18057859 0.33339148
H  3.86921572 1.27983755 1.8762802
H  5.85472131 0.14623525 1.2679404
H  5.90106225 1.03776447 -0.26998337
O  -6.16609821 -1.01876676 0.42171462
H  -7.11400864 -0.92715185 0.33644897
O  6.16628981 -1.01594924 -0.424364
H  7.11433509 -0.9214274 -0.34391391
