program: Gaussian 16
title: Title Card Required
version: ES64L-G16RevC.02
method: RM062X
basis: def2TZVPP
operation: Freq
keyword: #N
keyword: Geom=AllCheck
keyword: Guess=TCheck
keyword: SCRF=Check
keyword: GenChk
keyword: RM062X/def2TZVPP
keyword: Freq
converged: YES YES NO YES
title: Mulliken charges:
elementType: V V V O O O O O O V O O O O V O O O V C C C C C H H H H H H H H O O O O O C C O C H H H H C C H H H H O H O H
charge: 0.958872 0.959475 0.956880 -1.315348 -0.402226 -0.381094 -0.423925 -0.380725 -0.425203 0.961103 -0.381805 -0.380942 -0.425589 -0.403535 0.960870 -0.381571 -0.425232 -0.402865 0.957204 -0.188285 -0.192811 -0.191245 -0.140158 0.232504 0.128949 0.132391 0.120396 0.159549 0.157680 0.123947 0.113565 0.113783 -0.380649 -0.423401 -0.391055 -0.424349 -0.392036 -0.189741 -0.189356 -0.402440 0.232479 0.157236 0.123485 0.120767 0.159756 -0.193184 -0.140180 0.129157 0.132512 0.113522 0.113846 -0.357616 0.182129 -0.357619 0.182126
chargesum: -2.00000
title: Mulliken charges with hydrogens summed into heavy atoms:
elementType: V V V O O O O O O V O O O O V O O O V C C C C C O O O O O C C O C C C O O
charge: 0.958872 0.959475 0.956880 -1.315348 -0.402226 -0.381094 -0.423925 -0.380725 -0.425203 0.961103 -0.381805 -0.380942 -0.425589 -0.403535 0.960870 -0.381571 -0.425232 -0.402865 0.957204 0.091660 0.068530 0.090383 0.087190 0.232504 -0.380649 -0.423401 -0.391055 -0.424349 -0.392036 0.090979 0.091168 -0.402440 0.232479 0.068485 0.087187 -0.175487 -0.175493
1716.lowfreq: -9.0102 -4.8902 -4.5855 -0.0030 -0.0027 0.0042 69.9588 74.0359 93.4235
frequency: 69.9587 74.0357 93.4231 105.3695 124.7631 128.1549 141.5055 145.9697 147.8417 150.5677 155.4307 171.1798 175.7246 183.2318 184.8003 190.0751 191.7478 194.7637 207.3502 209.8676 219.4704 231.0080 233.3438 234.9186 238.3128 240.0977 240.4304 240.5752 245.1092 251.0205 253.3967 255.7610 261.0090 262.0720 271.3346 275.3818 285.1424 287.6845 303.2462 309.6118 328.9726 329.3117 339.0875 347.6117 347.9276 359.4458 387.4298 390.3149 395.1493 395.4084 400.4839 404.3025 422.5454 423.9851 434.5732 445.7703 446.2709 446.7541 450.6968 459.3636 460.4814 463.2304 465.1271 469.2777 470.4039 485.0140 490.5452 494.2492 510.5535 511.8114 531.9619 532.2842 627.3808 628.0281 629.4614 643.3066 644.2850 658.6566 662.8652 698.0520 755.6079 756.2333 810.9413 811.7125 817.8495 818.5877 890.1816 931.3323 931.4588 974.6535 974.8083 999.4233 999.8401 1043.0124 1043.0911 1069.1398 1069.3511 1088.6655 1089.1870 1091.7492 1098.0524 1098.2766 1121.2324 1130.1117 1130.9288 1132.8552 1141.4078 1161.9837 1164.5545 1184.2160 1188.4757 1197.4989 1203.8522 1228.9287 1229.0129 1266.9948 1267.0863 1285.7017 1285.8865 1290.7269 1290.9279 1359.0903 1359.2979 1376.2710 1376.3874 1385.6903 1385.8352 1388.2309 1388.3237 1439.6303 1441.3170 1452.8267 1452.9379 1492.6093 1492.8104 1496.3993 1496.8549 1511.7704 1512.1563 1520.7588 1520.9775 2988.3358 2988.4621 2996.6908 2996.9361 3004.5978 3005.4968 3011.6870 3012.4892 3023.5602 3023.6482 3036.1996 3036.4757 3071.9926 3072.6147 3076.1247 3076.3447 3915.8294 3915.9157
redmass: 8.3403 7.8550 5.8915 4.8858 1.7764 1.3626 6.2033 2.7017 7.0632 11.9490 5.2511 5.1669 6.1099 9.8438 6.2937 14.4943 15.6428 9.8795 21.0127 8.1895 11.3819 7.1439 7.1678 7.6054 10.1118 8.7447 7.1459 7.8807 7.0760 6.5625 10.6223 8.4195 13.8838 12.0807 8.9527 12.2201 6.9592 7.9085 10.8409 7.9054 14.3514 8.6714 8.2163 5.8665 6.0846 11.3227 5.4043 7.1182 6.7140 6.4744 7.5027 5.6874 3.2357 2.8072 12.7863 10.6121 10.2736 11.4686 9.4355 7.9115 8.5057 7.0907 5.4724 5.1701 5.4230 12.8221 4.4907 5.8363 3.5834 3.4794 5.7212 5.6969 18.6913 12.7788 13.0805 16.5803 16.3453 4.1837 4.0055 15.1406 16.4830 16.5436 15.3007 15.4934 4.0155 4.0074 17.7990 1.9480 1.9489 1.3827 1.3829 2.3636 2.3620 1.7938 1.7941 5.2969 5.2671 17.5858 17.7368 17.0533 17.8829 18.0216 9.4375 6.0300 7.6019 6.9356 6.4375 6.3705 5.5373 1.8896 1.6935 2.8534 4.1012 1.7540 1.7545 1.3811 1.3803 1.0829 1.0837 1.1130 1.1140 1.5006 1.4990 1.2753 1.2772 1.4552 1.4622 1.2613 1.2568 1.4621 1.4780 1.4082 1.4074 1.0759 1.0757 1.0748 1.0747 1.0867 1.0867 1.0882 1.0882 1.0541 1.0542 1.0560 1.0559 1.0635 1.0633 1.0633 1.0634 1.1064 1.1064 1.1056 1.1054 1.0988 1.0991 1.0975 1.0969 1.0666 1.0666
irintensity: 0.2785 0.0212 5.2915 16.7825 60.5934 30.2341 12.2583 33.3470 4.4177 4.6094 7.3419 0.2303 1.3481 0.1242 2.1092 1.6387 1.8215 2.8959 0.5263 0.3935 0.3020 0.6139 2.5586 5.8908 3.1534 0.4546 1.0910 0.3559 1.2645 2.9320 4.7065 2.9047 0.1350 0.2971 1.4522 2.2628 1.6748 0.3534 0.3067 2.5351 0.6642 6.5730 0.3942 0.2568 0.3952 45.8479 4.2784 2.3925 39.6586 38.5647 29.5348 11.0097 18.4799 6.4475 2.1291 44.5692 50.1269 4.0305 253.1513 4.4975 3.0764 1.8348 15.3800 2.6626 90.8253 21.0331 15.9931 56.2193 0.1235 0.5333 34.7818 35.7831 110.3066 225.7727 211.6106 1.5214 6.1402 8.2024 108.7398 7.4495 840.6767 837.8199 3.5965 2.2541 2.5990 1.4780 1882.4909 2.1614 2.3243 0.0222 0.0198 6.7861 6.3895 8.7740 5.8064 56.0971 37.9954 167.5768 541.6720 362.1989 510.4980 443.9840 14.8344 159.5995 3.7798 57.5923 2.7542 91.7418 72.4311 523.2806 11.6653 406.3159 3.2584 7.5974 9.8859 29.2701 39.8512 0.2278 0.2625 0.4120 0.6956 8.4410 8.3075 0.7608 1.4825 1.4998 1.8275 0.9381 1.1528 128.9292 0.9560 0.0406 0.0232 1.7831 1.8102 1.8772 1.8381 0.0535 0.0362 18.8093 11.7288 7.2060 2.8960 115.7715 103.1518 66.2481 48.5028 281.4207 20.6670 12.0360 13.2562 56.1219 68.6773 9.2938 8.6978 20.4272 22.9415 29.9343 25.0949
temp: 298.150 k
press: 1.00000 atm
elementType: 23 23 23 8 8 8 8 8 8 23 8 8 8 8 23 8 8 8 23 6 6 6 6 6 1 1 1 1 1 1 1 1 8 8 8 8 8 6 6 8 6 1 1 1 1 6 6 1 1 1 1 8 1 8 1
symmnumber: 1
zpe: 935397.1 jmol-1
zpe.correction: 0.356274 hartree
zpe.thermalcorrener: 0.393134 hartree
zpe.thermalcorrenthalpy: 0.394078 hartree
zpe.thermalcorrgfe: 0.296103 hartree
zpe.sumelectzpe: -7636.035149 hartree
zpe.sumelectthermal: -7635.998289 hartree
zpe.sumelectthermalent: -7635.997345 hartree
zpe.sumelectthermalfe: -7636.095320 hartree
dipole: -0.0027 1.0503 0.0133
dipole: 1.0504
quadrupole: -289.2994 -341.7044 -339.7437
quadrupole: 0.0626 6.9357 -0.0112
quadrupole: 34.2831 -18.1219 -16.1612 0.0626 6.9357 -0.0112
hfenergy: -7636.3914232 hartree
pointgroup: C01 [X(C10H18O21V6)]
dipole: 0.0010248 0.4131053 -0.0113036 debye
polarizability: 478.6849687|0.0360035|308.9485925|4.1832016|-0.0260688|307.8275453 unknown
InChI: InChI=1S/2C5H9O4.13O.6V/c2*6-1-5(2-7,3-8)4-9;;;;;;;;;;;;;;;;;;;/h2*6H,1-4H2;;;;;;;;;;;;;;;;;;;
charge -2 multiplicity 1
55 atoms
V  -1.09203225 0.10908071 -1.97913559
V  1.1799143 1.76136934 -0.8752412
V  1.19142617 -1.60001125 -0.99346557
O  -0.00014347 0.046133 0.00044006
O  -2.08859922 0.08081966 -3.18592092
O  -2.14489164 1.36617117 -0.83111866
O  0.07261557 -1.30382253 -2.28667951
O  -2.15125896 -1.2764254 -0.83297165
O  0.07069529 1.35084994 -2.31162413
V  -1.18618138 1.68567854 1.00023593
O  2.22241641 0.04581832 -1.45493844
O  2.14414803 1.36527748 0.83375136
O  0.00248388 2.69885004 -0.0229309
O  2.23300645 2.76477488 -1.45463545
V  1.09456078 -0.03393956 1.97759598
O  -2.22299148 0.04189741 1.4564355
O  -0.07410056 1.39117467 2.28895519
O  -2.23603016 2.72242119 1.52413591
V  -1.18783299 -1.67398921 0.86859167
C  -3.62069879 0.03918172 1.33823949
C  -3.53956215 1.29693057 -0.83225332
C  -3.55285791 -1.21232167 -0.83805873
C  -5.58657185 0.10292863 -0.20870664
C  -4.07368887 0.0420614 -0.12662793
H  -3.89460747 1.30062299 -1.8717155
H  -3.93217816 2.18700135 -0.32297453
H  -4.02149705 0.93146607 1.83748528
H  -4.0137664 -0.85184604 1.83588318
H  -3.9541227 -2.10174328 -0.3434318
H  -3.89650211 -1.19911087 -1.88065117
H  -5.93122713 1.0292516 0.26921373
H  -5.88424362 0.1331123 -1.26495199
O  2.15249615 -1.27814843 0.83174752
O  -0.00062165 -2.60900882 0.02436113
O  2.23238015 -2.63767571 -1.52319623
O  -0.07125938 -1.26323832 2.31152232
O  -2.22970258 -2.68069675 1.45394352
C  3.62017835 0.04519647 -1.33781696
C  3.55405176 -1.21415525 0.83415683
O  2.08856635 0.00270071 3.18650545
C  4.07370452 0.04307694 0.12682224
H  4.02235001 -0.83838864 -1.84215553
H  4.01122403 0.94502738 -1.83050235
H  3.9075325 -1.21057859 1.8738726
H  3.94665705 -2.1012405 0.32923951
C  3.53888677 1.29514462 0.83692691
C  5.58658372 0.1046348 0.2084186
H  3.94035979 2.18779392 0.33844061
H  3.88431094 1.28866413 1.87922352
H  5.88418738 0.14500769 1.26434728
H  5.93146605 1.02616021 -0.27846108
O  -6.17357286 -1.02549738 0.43271905
H  -7.12501883 -0.95414567 0.35530049
O  6.17335174 -1.03027602 -0.42170101
H  7.12494649 -0.95619094 -0.34882109
