program: Gaussian 09
title: 000042396
version: EM64L-G09RevD.01
frameworkgroup: C1[X(C12H19NO3)]
method: RPBEPBE
basis: SDD
operation: Freq
keyword: #p
keyword: freq=noraman
keyword: PBEPBE/SDD
title: #p freq=noraman PBEPBE/SDD
converged: YES YES NO NO
title: Mulliken charges:
elementType: O O O N C C C C C C C C C C C C H H H H H H H H H H H H H H H H H H H
charge: -0.318628 -0.451139 -0.438601 -0.314420 -0.418937 -0.128413 -0.058449 -0.311120 -0.681445 -0.698971 0.382381 -0.306996 -0.362402 -0.383004 -0.322594 0.275972 0.221408 0.228264 0.212790 0.212622 0.239350 0.237923 0.225637 0.232091 0.200285 0.212532 0.197236 0.208915 0.233613 0.352875 0.251085 0.248263 0.217384 0.252876 0.351622
chargesum: 0.00000
title: Mulliken charges with hydrogens summed into heavy atoms:
elementType: O O O N C C C C C C C C C C C C
charge: -0.318628 -0.098263 -0.086980 -0.075071 0.030736 0.084376 0.154173 0.152440 -0.036538 -0.059208 0.382381 -0.055911 -0.114139 -0.165621 -0.069718 0.275972
polarizability: 1.85612828e+02 2.17421035e+01 1.22758903e+02 -3.97274216e+00 7.12353488e+00 1.37595607e+02
1716.lowfreq: -4.0411 -0.0004 -0.0003 -0.0001 6.3999 10.8522 19.1449 35.6281 47.9270
frequency: 19.0842 35.4695 47.6554 56.2548 96.8727 105.5032 128.6629 166.4558 175.5444 205.6054 214.3880 251.5626 259.9121 308.3605 322.6336 342.4149 353.6430 381.6853 407.6607 414.3352 423.2079 442.8939 457.7125 481.5546 508.1200 513.3300 600.9673 635.3690 675.4540 702.8716 757.8760 786.3997 819.8230 825.8900 829.6228 849.2380 896.8498 909.3436 917.5531 922.6821 938.5838 948.8260 953.1695 995.4282 997.3370 1067.9595 1097.8945 1101.1304 1103.0527 1130.9845 1142.6398 1151.5800 1172.1107 1175.3942 1207.2150 1222.6703 1232.6488 1248.9485 1254.6874 1303.8255 1311.3045 1320.6603 1338.1957 1348.9328 1364.3124 1372.6890 1380.5432 1389.9346 1394.1530 1431.7121 1447.4063 1458.0392 1462.8722 1463.9712 1480.3061 1483.2676 1484.8528 1499.0970 1601.7344 1628.6350 2932.0631 2966.5562 2973.5064 2976.4893 2982.0053 3025.0540 3042.9242 3051.7166 3060.9787 3070.6753 3071.5184 3092.3043 3118.5771 3154.7807 3167.9949 3177.7862 3416.3877 3527.4549 3587.1327
redmass: 4.8067 3.6913 2.7050 4.5560 3.7232 5.4780 3.7335 4.8102 4.4519 1.0532 2.1807 1.5495 1.8064 3.0161 1.1127 5.0590 6.3936 2.5099 3.5654 2.9364 2.4441 1.2385 2.1961 3.2951 2.3526 3.8450 3.7457 6.4243 1.5921 3.7168 4.9299 1.3348 3.0116 1.5574 3.5490 2.9850 1.4039 1.3282 1.7812 2.3098 1.4641 1.3559 3.1853 2.3847 2.0919 1.8292 1.4834 3.2460 1.6676 2.0919 1.3749 1.5516 1.1920 1.9831 2.5140 1.4779 1.4406 1.4541 2.9603 1.3207 1.3931 1.2719 1.3161 1.3380 1.2770 1.2932 1.3450 1.2369 5.2969 3.0254 1.1625 1.1398 1.0564 1.0475 1.0830 1.0754 1.0589 2.4577 7.0004 6.5059 1.0670 1.0354 1.0418 1.0556 1.0799 1.0876 1.0918 1.1078 1.0987 1.0979 1.0994 1.1001 1.0898 1.0883 1.0936 1.0973 1.0737 1.0652 1.0661
irintensity: 0.0451 1.6062 0.2786 0.1962 0.7734 1.3903 0.8802 0.7719 4.8191 0.4802 4.4570 1.0528 2.3474 4.1782 143.8080 8.2797 1.2651 0.4229 26.0722 1.7185 1.4449 129.8416 40.2639 7.3631 29.8592 19.8119 16.4046 1.3611 85.2080 0.3326 44.8675 28.7052 3.5713 63.5243 3.6030 20.0406 2.0561 3.4283 10.5535 33.6653 1.0997 2.1852 55.8094 23.0392 24.3138 58.2158 35.4559 43.4825 37.1446 14.8201 203.6093 23.8892 35.4437 68.7310 248.6637 15.8413 5.7240 7.8027 8.7981 26.2275 11.4931 5.2536 0.8984 4.0221 18.5115 24.1895 35.3643 26.6279 18.1840 35.3476 20.8570 69.5964 8.3812 1.5551 6.7103 12.7730 14.9460 225.4953 3.3695 1.5590 63.3101 31.9892 21.2660 26.6250 25.8831 8.4719 49.3844 24.5106 6.7930 72.5720 50.9020 39.5677 22.0212 6.2576 10.6818 3.4485 1.5626 16.6709 37.2281
temp: 298.150 k
press: 1.00000 atm
elementType: 8 8 8 7 6 6 6 6 6 6 6 6 6 6 6 6 1 1 1 1 1 1 1 1 1 1 1 1 1 1 1 1 1 1 1
symmnumber: 1
zpe: 770126.4 jmol-1
zpe.correction: 0.293326 hartree
zpe.thermalcorrener: 0.310767 hartree
zpe.thermalcorrenthalpy: 0.311711 hartree
zpe.thermalcorrgfe: 0.246738 hartree
zpe.sumelectzpe: -747.813638 hartree
zpe.sumelectthermal: -747.796197 hartree
zpe.sumelectthermalent: -747.795253 hartree
zpe.sumelectthermalfe: -747.860226 hartree
dipole: 0.7122 -2.2797 -2.0553
dipole: 3.1509
quadrupole: -91.1991 -107.6188 -88.1633
quadrupole: -1.6834 7.5838 2.9125
quadrupole: 4.4613 -11.9584 7.4971 -1.6834 7.5838 2.9125
hfenergy: -748.106964 hartree
pointgroup: C01 [X(C12H19N1O3)]
dipole: 0.1764972 -0.7720791 -0.9536992 debye
polarizability: 188.1789496|17.6713968|118.1554823|-2.7450257|3.4571534|139.6329058 unknown
InChI: InChI=1S/C12H19NO3/c1-9(2)13-7-11(15)8-16-12-5-3-10(14)4-6-12/h3-6,9,11,13-15H,7-8H2,1-2H3
charge 0 multiplicity 1
35 atoms
O  -0.207196 1.008102 0.407313
O  1.767683 2.933325 0.565557
O  -5.485441 -0.965126 0.273651
N  3.121335 -0.368999 -0.670213
C  2.762191 0.666091 0.324324
C  1.928542 1.788816 -0.342689
C  3.429395 -1.727254 -0.144039
C  0.562418 1.285051 -0.824243
C  4.668042 -1.772924 0.792689
C  3.59163 -2.696059 -1.332638
C  -1.520567 0.519215 0.270754
C  -2.151035 0.262153 -0.968759
C  -2.21647 0.279445 1.482731
C  -3.47598 -0.23458 -0.990476
C  -3.532014 -0.213667 1.459036
C  -4.165335 -0.471789 0.219118
H  2.148982 0.189479 1.112778
H  3.630745 1.148616 0.82536
H  2.482502 2.189641 -1.212034
H  2.54075 -2.039664 0.441642
H  3.863966 -0.046041 -1.30835
H  0.696241 0.359235 -1.415768
H  0.040605 2.063254 -1.415179
H  4.55727 -1.064209 1.633555
H  5.586971 -1.505479 0.235268
H  4.80881 -2.784879 1.216693
H  4.4560 -2.404705 -1.962041
H  3.76717 -3.72853 -0.980567
H  2.686901 -2.685044 -1.964831
H  1.044184 2.692089 1.202307
H  -1.632177 0.438034 -1.914862
H  -1.711635 0.483433 2.43196
H  -3.960749 -0.432896 -1.955265
H  -4.082054 -0.403723 2.385125
H  -5.843278 -1.10961 -0.636908
