program: Orca
programVersion: 5.0.3
elementType: C H H C C H C H C N H C H H C C H C H C N H C H H C C H C H C N H Li
charge: 0
multiplicity: 2
keywords: MP2 aug-cc-pVTZ NORI SP SlowConv VeryTightSCF defgrid3 NBO
formula: C15H15LiN3
InChI: InChI=1S/C15H15N3.Li/c1-2-11-8-13-5-6-15(18-13)9-14-4-3-12(17-14)7-10(1)16-11;/h1-6,16-18H,7-9H2;
34 atoms
C  -2.448115 1.413522 0.543708
H  -3.256972 1.880638 -0.011764
H  -2.657108 1.5343 1.612248
C  -1.135265 2.053551 0.182323
C  -0.711851 2.719655 -0.941897
H  -1.350977 3.135077 -1.703056
C  0.71185 2.719656 -0.941896
H  1.350977 3.135078 -1.703055
C  1.135265 2.053551 0.182323
N  0.0000 1.654388 0.854116
H  0.0000 1.306482 1.825889
C  2.448115 1.413522 0.543707
H  2.657106 1.5343 1.612248
H  3.256972 1.880638 -0.011763
C  2.346362 -0.04348 0.182417
C  2.713262 -0.743849 -0.940793
H  3.393747 -0.39851 -1.701124
C  2.001245 -1.976748 -0.94128
H  2.042516 -2.738331 -1.702007
C  1.210874 -2.00967 0.181648
N  1.43175 -0.826524 0.853164
H  1.130249 -0.652776 1.824961
C  0.0000 -2.826627 0.542348
H  0.0000 -3.068735 1.61074
H  0.0000 -3.760321 -0.013715
C  -1.210874 -2.00967 0.181649
C  -2.001245 -1.976748 -0.941279
H  -2.042517 -2.738332 -1.702006
C  -2.713261 -0.743849 -0.940794
H  -3.393746 -0.398509 -1.701125
C  -2.346361 -0.04348 0.182418
N  -1.43175 -0.826524 0.853164
H  -1.130249 -0.652776 1.824961
Li -0.000001 0.001101 -0.557166
totalener: -747.71417059 hartree
nucrepener: 1400.31601169 hartree
electener: -2148.03018228 hartree
oneelecener: -3793.25734430 hartree
twoeener: 1645.22716202 hartree
kineticenergy: 746.99551476 hartree
s2: 0.750660
chargesum: -0.0000000
charge: 0.007115 0.256654 0.393468 0.620706 -1.018571 0.565728 -1.018570 0.565722 0.620708 -0.137092 -0.376607 0.007121 0.393466 0.256657 0.621089 -1.020180 0.564621 -1.019389 0.564566 0.622113 -0.136469 -0.377426 0.006960 0.393458 0.256654 0.622104 -1.019401 0.564567 -1.020176 0.564624 0.621071 -0.136466 -0.377427 -1.431399
charge: 0.389630 -0.131654 -0.134331 -0.099855 0.303430 -0.153540 0.303430 -0.153539 -0.099855 0.604235 -0.289026 0.389630 -0.134330 -0.131655 -0.099997 0.303207 -0.153696 0.303229 -0.153704 -0.100001 0.604063 -0.289056 0.389578 -0.134316 -0.131679 -0.100002 0.303228 -0.153703 0.303208 -0.153695 -0.099997 0.604062 -0.289056 -1.614242
qa: 0.0071 0.2567 0.3935 0.6207 -1.0186 0.5657 -1.0186 0.5657 0.6207 -0.1371 -0.3766 0.0071 0.3935 0.2567 0.6211 -1.0202 0.5646 -1.0194 0.5646 0.6221 -0.1365 -0.3774 0.0070 0.3935 0.2567 0.6221 -1.0194 0.5646 -1.0202 0.5646 0.6211 -0.1365 -0.3774 -1.4314
va: 2.9258 0.8951 0.7647 2.3705 3.0331 0.7045 3.0331 0.7046 2.3705 3.2010 1.6525 2.9258 0.7647 0.8951 2.3670 3.0339 0.7063 3.0336 0.7066 2.3659 3.1986 1.6532 2.9252 0.7646 0.8951 2.3659 3.0336 0.7066 3.0339 0.7063 2.3670 3.1986 1.6532 1.9617
total: -750.847307825 hartree
energy: -750.847307824580
dipole: -0.00000 0.00000 0.00000 -0.00353 0.00517 0.00164 0.73020 -4.45843 -3.72823
magnitude: 3.72823 au
magnitude: 9.47640 debye
