charge: 0
program: ADF
programVersion: 2019
title: C3PLi EDA
runtype: SINGLE POINT
method: DFT
formula: C15H15LiN3
InChI: InChI=1S/C15H15N3.Li/c1-2-11-8-13-5-6-15(18-13)9-14-4-3-12(17-14)7-10(1)16-11;/h1-6,16-18H,7-9H2;
34 atoms
C  1.4396 0.4848 -2.4481
H  1.8782 -0.0934 -3.2570
H  1.6138 1.5460 -2.6571
C  2.0607 0.0918 -1.1353
C  2.6696 -1.0644 -0.7119
H  3.0463 -1.8455 -1.3510
C  2.6696 -1.0644 0.7119
H  3.0463 -1.8455 1.3510
C  2.0607 0.0918 1.1353
N  1.6957 0.7828 0.0000
H  1.3970 1.7708 0.0000
C  1.4396 0.4848 2.4481
H  1.6138 1.5460 2.6571
H  1.8782 -0.0934 3.2570
C  -0.0337 0.1970 2.3464
C  -0.7895 -0.8896 2.7133
H  -0.4827 -1.6663 3.3937
C  -2.0209 -0.8283 2.0012
H  -2.8197 -1.5499 2.0425
C  -1.9975 0.2949 1.2109
N  -0.7821 0.9062 1.4317
H  -0.5599 1.8681 1.1302
C  -2.7953 0.6961 0.0000
H  -2.9835 1.7753 0.0000
H  -3.7557 0.1875 0.0000
C  -1.9975 0.2949 -1.2109
C  -2.0209 -0.8283 -2.0012
H  -2.8197 -1.5499 -2.0425
C  -0.7895 -0.8896 -2.7133
H  -0.4827 -1.6663 -3.3937
C  -0.0337 0.1970 -2.3464
N  -0.7821 0.9062 -1.4317
H  -0.5599 1.8681 -1.1302
Li -0.0263 -0.5438 0.0000
spinMolecule: UNrestricted
energy: -12.036 -12.036 -11.991 -9.765 -8.856 -8.855 -8.201 -8.199 -7.215 -3.069 -0.017 0.453 0.820 0.821 1.214 1.214 1.279 1.466 1.533 1.533 -12.443 -12.013 -12.013 -11.965 -9.679 -8.786 -8.785 -8.075 -8.073 -7.160 -0.084 0.053 0.806 0.832 0.833 1.370 1.370 1.433 1.466 1.529 electronvolt
elementType: C H H C C H C H C N H C H H C C H C H C N H C H H C C H C H C N H Li
charge: 0.6712 -0.2930 -0.2197 -0.1908 -0.1130 0.0154 -0.1134 0.0157 -0.1907 0.7556 -0.4062 0.6712 -0.2198 -0.2930 -0.1875 -0.1108 0.0151 -0.1182 0.0177 -0.1891 0.7312 -0.3934 0.6753 -0.2174 -0.2929 -0.1890 -0.1189 0.0183 -0.1107 0.0149 -0.1875 0.7307 -0.3929 0.2158
mdcq: 0.088649 -0.057988 0.013233 0.033860 0.023245 0.007780 0.023245 0.007779 0.033862 -0.433690 0.547277 0.088648 0.013232 -0.057987 0.034871 0.020313 0.009138 0.019291 0.009026 0.030604 -0.427396 0.550348 0.087867 0.017495 -0.057849 0.030603 0.019292 0.009025 0.020313 0.009137 0.034872 -0.427403 0.550360 0.128947
s2: 0.75000
dipole: -0.17828283 -3.72089469 0.00003945
dipole: 3.72516336
quadrupole: 2.68864729 -0.40280065 0.00001064 -5.40859013 0.00012249 2.71994285
eener: -4.3636 electronvolt
kinener: 11.5164 electronvolt
coulombener: -9.3536 electronvolt
xcener: -4.2597 electronvolt
dispener: -0.0925 electronvolt
total: -6.5530 electronvolt
mo.energy: -24.662 electronvolt
energy: -20.899 1.318 electronvolt
mo.energy: -24.661 electronvolt
mo.energy: -24.002 electronvolt
energy: -20.137 -6.336 electronvolt
mo.energy: -23.686 electronvolt
energy: -19.846 -4.281 electronvolt
mo.energy: -23.685 electronvolt
energy: -19.845 -4.281 electronvolt
mo.energy: -22.933 electronvolt
energy: -19.299 -20.137 electronvolt
mo.energy: -22.095 electronvolt
energy: -18.256 8.954 electronvolt
mo.energy: -20.147 electronvolt
energy: -16.445 -20.899 electronvolt
mo.energy: -20.146 electronvolt
energy: -16.444 -20.899 electronvolt
mo.energy: -18.696 electronvolt
energy: -14.870 -6.336 electronvolt
mo.energy: -18.331 electronvolt
energy: -14.564 -14.328 electronvolt
energy: -14.564 -14.327 electronvolt
mo.energy: -18.116 electronvolt
energy: -14.328 -4.281 electronvolt
mo.energy: -18.115 electronvolt
energy: -14.327 -4.281 electronvolt
mo.energy: -17.699 electronvolt
energy: -13.945 -9.626 electronvolt
mo.energy: -16.184 electronvolt
energy: -12.484 -10.361 electronvolt
mo.energy: -16.183 electronvolt
mo.energy: -16.023 electronvolt
energy: -12.158 -11.119 electronvolt
mo.energy: -14.881 electronvolt
energy: -11.119 -9.980 -12.158 electronvolt
mo.energy: -14.597 electronvolt
energy: -10.813 -10.361 -8.645 -9.774 electronvolt
mo.energy: -14.596 electronvolt
energy: -10.811 -10.361 -8.646 -9.774 electronvolt
mo.energy: -14.108 electronvolt
energy: -10.361 -10.811 electronvolt
energy: -10.361 -10.813 electronvolt
mo.energy: -13.914 electronvolt
energy: -10.076 -9.980 -11.119 -12.158 electronvolt
mo.energy: -13.618 electronvolt
energy: -9.980 -10.076 -11.119 electronvolt
mo.energy: -13.521 electronvolt
energy: -9.774 -10.811 -8.646 electronvolt
mo.energy: -13.520 electronvolt
energy: -9.774 -10.813 -8.645 electronvolt
mo.energy: -13.327 electronvolt
energy: -9.626 -9.085 electronvolt
mo.energy: -12.764 electronvolt
energy: -9.085 -9.626 electronvolt
mo.energy: -12.708 electronvolt
energy: -8.908 -8.645 -9.774 electronvolt
mo.energy: -12.707 electronvolt
energy: -8.906 -8.646 -9.774 electronvolt
mo.energy: -12.464 electronvolt
energy: -8.645 -8.908 electronvolt
mo.energy: -12.463 electronvolt
energy: -8.646 -8.906 electronvolt
mo.energy: -12.036 electronvolt
energy: -8.393 -8.906 electronvolt
energy: -8.393 -8.908 electronvolt
mo.energy: -11.991 electronvolt
energy: -8.248 -9.980 electronvolt
mo.energy: -9.765 electronvolt
energy: -5.584 -4.281 electronvolt
mo.energy: -8.856 electronvolt
energy: -4.854 1.318 electronvolt
mo.energy: -8.855 electronvolt
mo.energy: -8.201 electronvolt
energy: -4.184 1.318 electronvolt
mo.energy: -8.199 electronvolt
energy: -4.183 1.318 electronvolt
mo.energy: -7.215 electronvolt
energy: -3.339 8.954 electronvolt
mo.energy: -3.069 electronvolt
energy: 1.942 3.952 3.439 -4.281 -2.134 2.714 electronvolt
mo.energy: -0.017 electronvolt
energy: -2.134 -6.336 1.942 3.439 4.354 -4.281 6.771 1.318 3.952 4.964 electronvolt
mo.energy: 0.453 electronvolt
energy: 3.952 4.354 -2.134 -4.281 4.964 1.942 1.329 -6.336 3.439 electronvolt
mo.energy: 0.820 electronvolt
energy: 3.503 -4.281 2.714 electronvolt
mo.energy: 0.821 electronvolt
energy: 3.504 -4.281 2.714 electronvolt
mo.energy: 1.214 electronvolt
energy: 4.103 5.413 5.058 -4.281 4.242 5.345 2.714 1.318 1.318 3.503 electronvolt
energy: 4.104 5.414 5.059 -4.281 4.242 5.346 2.714 1.318 3.504 1.318 1.318 electronvolt
mo.energy: 1.279 electronvolt
energy: 3.952 4.354 1.329 4.964 -4.281 6.771 -2.134 1.942 2.714 1.318 7.164 9.037 6.194 1.318 electronvolt
mo.energy: 1.466 electronvolt
energy: -4.281 4.964 -6.336 3.439 6.194 -2.134 1.329 6.771 -5.584 9.037 3.952 16.243 1.318 13.716 electronvolt
mo.energy: 1.533 electronvolt
energy: 4.242 5.059 4.104 5.414 -4.281 1.318 electronvolt
energy: 4.242 5.058 4.103 5.413 -4.281 1.318 electronvolt
mo.energy: 1.568 electronvolt
energy: 4.242 4.103 5.413 5.058 -4.281 electronvolt
energy: 4.242 4.104 5.414 5.059 -4.281 electronvolt
mo.energy: 1.884 electronvolt
energy: 3.439 -6.336 4.964 6.771 -2.134 1.329 4.354 10.092 9.037 7.164 6.194 9.655 13.716 9.362 11.377 1.942 17.946 8.309 electronvolt
mo.energy: 2.151 electronvolt
energy: 5.413 5.345 6.307 5.058 6.384 2.714 1.318 -4.281 3.503 electronvolt
mo.energy: 2.154 electronvolt
energy: 5.414 5.346 6.306 5.059 6.385 2.714 -4.281 3.504 electronvolt
mo.energy: 2.468 electronvolt
energy: 5.114 6.987 electronvolt
mo.energy: 2.537 electronvolt
energy: 5.345 5.058 5.413 -4.281 6.307 electronvolt
mo.energy: 2.538 electronvolt
energy: 5.346 5.059 5.414 -4.281 6.306 electronvolt
mo.energy: 2.645 electronvolt
energy: 6.771 4.964 3.439 6.194 -2.134 4.354 1.329 9.037 1.942 3.952 9.655 8.309 10.682 7.164 -4.281 10.092 14.870 16.243 13.716 -6.336 17.547 11.377 12.939 electronvolt
mo.energy: 2.927 electronvolt
energy: 6.384 5.345 6.307 5.058 5.413 -4.281 electronvolt
energy: 6.385 5.346 6.306 5.059 5.414 -4.281 electronvolt
mo.energy: 3.194 electronvolt
energy: 6.538 6.987 electronvolt
mo.energy: 3.235 electronvolt
energy: 6.306 6.385 5.346 -4.281 electronvolt
mo.energy: 3.236 electronvolt
energy: 6.307 6.384 5.345 -4.281 electronvolt
mo.energy: 3.447 electronvolt
energy: 6.194 1.942 -2.134 3.439 1.329 4.964 6.771 10.682 2.714 8.309 7.164 9.362 electronvolt
mo.energy: 3.955 electronvolt
energy: 6.987 6.538 electronvolt
mo.energy: 3.957 electronvolt
energy: 7.164 6.771 6.194 -4.281 -2.134 1.942 -6.336 4.354 1.329 2.714 electronvolt
mo.energy: 4.074 electronvolt
energy: 7.137 -4.281 10.332 1.318 6.307 electronvolt
mo.energy: 4.075 electronvolt
energy: 7.138 -4.281 10.332 6.306 electronvolt
mo.energy: 4.584 electronvolt
energy: 7.835 -4.281 3.504 7.138 10.332 9.448 electronvolt
energy: 7.835 -4.281 3.503 7.137 10.332 9.449 1.318 electronvolt
mo.energy: 4.999 electronvolt
energy: 8.309 1.329 -6.336 -4.281 11.377 9.037 2.714 16.243 -2.134 10.092 9.362 6.194 1.318 3.952 9.655 1.318 4.964 13.716 7.164 6.771 1.942 electronvolt
mo.energy: 5.129 electronvolt
energy: -4.281 7.835 2.714 8.540 1.318 10.332 7.137 1.318 8.877 9.449 10.512 3.503 6.384 13.250 13.669 15.900 8.954 15.003 12.580 14.256 18.005 -4.184 19.309 -25.370 11.936 electronvolt
mo.energy: 5.130 electronvolt
energy: -4.281 7.835 2.714 8.541 1.318 10.332 7.138 8.878 9.448 10.512 1.318 3.504 1.318 6.385 13.249 13.669 15.903 15.001 12.581 8.954 14.256 18.006 -4.183 19.311 -25.370 11.935 electronvolt
mo.energy: -24.627 electronvolt
mo.energy: -24.626 electronvolt
mo.energy: -23.951 electronvolt
energy: -20.137 -6.336 -4.281 electronvolt
mo.energy: -23.647 electronvolt
mo.energy: -23.646 electronvolt
mo.energy: -22.910 electronvolt
mo.energy: -22.056 electronvolt
mo.energy: -20.130 electronvolt
mo.energy: -20.129 electronvolt
mo.energy: -18.585 electronvolt
mo.energy: -18.291 electronvolt
mo.energy: -18.065 electronvolt
energy: -14.328 -14.564 electronvolt
mo.energy: -18.064 electronvolt
energy: -14.327 -14.564 electronvolt
mo.energy: -17.683 electronvolt
mo.energy: -16.133 electronvolt
energy: -12.484 -4.281 electronvolt
mo.energy: -16.132 electronvolt
mo.energy: -15.981 electronvolt
mo.energy: -14.841 electronvolt
mo.energy: -14.544 electronvolt
energy: -10.813 -10.361 -8.645 electronvolt
mo.energy: -14.543 electronvolt
energy: -10.811 -10.361 -8.646 electronvolt
mo.energy: -14.090 electronvolt
mo.energy: -14.089 electronvolt
mo.energy: -13.861 electronvolt
energy: -10.076 -9.980 -11.119 electronvolt
mo.energy: -13.580 electronvolt
mo.energy: -13.480 electronvolt
energy: -9.774 -10.811 electronvolt
mo.energy: -13.479 electronvolt
energy: -9.774 -10.813 electronvolt
mo.energy: -13.287 electronvolt
energy: -9.626 -13.945 electronvolt
mo.energy: -12.749 electronvolt
mo.energy: -12.670 electronvolt
mo.energy: -12.669 electronvolt
mo.energy: -12.443 electronvolt
mo.energy: -12.013 electronvolt
mo.energy: -11.965 electronvolt
mo.energy: -9.679 electronvolt
mo.energy: -8.786 electronvolt
mo.energy: -8.785 electronvolt
mo.energy: -8.075 electronvolt
mo.energy: -8.073 electronvolt
mo.energy: -7.160 electronvolt
mo.energy: -0.084 electronvolt
energy: -2.134 1.942 3.952 1.329 3.439 -6.336 4.354 6.771 2.714 electronvolt
mo.energy: 0.053 electronvolt
energy: -2.134 -6.336 1.942 3.439 4.354 3.952 6.771 4.964 1.329 electronvolt
mo.energy: 0.806 electronvolt
energy: 3.952 1.942 -4.281 4.354 6.771 -2.134 3.439 2.714 4.964 -6.336 electronvolt
mo.energy: 0.832 electronvolt
mo.energy: 0.833 electronvolt
mo.energy: 1.370 electronvolt
energy: 4.104 4.242 5.414 -4.281 2.714 1.318 1.318 1.318 electronvolt
energy: 4.103 4.242 5.413 -4.281 1.318 2.714 1.318 electronvolt
mo.energy: 1.433 electronvolt
energy: 4.354 3.439 -4.281 1.329 -6.336 3.952 6.771 -2.134 1.318 7.164 1.318 electronvolt
energy: 4.964 -4.281 6.194 4.354 3.952 -2.134 6.771 9.037 -5.584 1.329 7.164 1.942 16.243 electronvolt
mo.energy: 1.529 electronvolt
energy: 4.242 5.059 -4.281 4.104 5.414 1.318 electronvolt
energy: 4.242 5.058 -4.281 4.103 5.413 1.318 1.318 electronvolt
mo.energy: 1.650 electronvolt
energy: 5.058 5.413 4.103 4.242 -4.281 5.345 electronvolt
energy: 5.059 5.414 4.104 4.242 -4.281 5.346 electronvolt
mo.energy: 1.900 electronvolt
energy: -6.336 4.964 3.439 6.771 1.329 1.942 -2.134 10.092 9.037 7.164 6.194 13.716 9.655 9.362 17.946 11.377 1.318 electronvolt
mo.energy: 2.180 electronvolt
energy: 5.413 5.058 5.345 6.307 6.384 2.714 1.318 electronvolt
mo.energy: 2.182 electronvolt
energy: 5.414 5.059 5.346 6.306 6.385 2.714 electronvolt
mo.energy: 2.462 electronvolt
energy: 5.345 5.058 5.413 6.307 -4.281 6.384 electronvolt
energy: 5.346 5.059 5.414 6.306 -4.281 6.385 electronvolt
mo.energy: 2.619 electronvolt
energy: 6.771 4.964 3.439 6.194 -2.134 4.354 1.329 9.037 9.655 3.952 8.309 7.164 10.682 1.942 -4.281 10.092 14.870 16.243 -6.336 13.716 17.547 11.377 12.939 electronvolt
mo.energy: 2.978 electronvolt
energy: 6.384 6.307 5.345 5.058 5.413 -4.281 electronvolt
energy: 6.385 6.306 5.346 5.059 5.414 -4.281 electronvolt
mo.energy: 3.199 electronvolt
mo.energy: 3.278 electronvolt
energy: 6.306 6.385 -4.281 5.346 2.714 electronvolt
mo.energy: 3.279 electronvolt
energy: 6.307 6.384 -4.281 5.345 2.714 electronvolt
mo.energy: 3.404 electronvolt
energy: 6.194 3.439 -2.134 4.964 1.942 1.329 6.771 10.682 8.309 2.714 9.362 electronvolt
mo.energy: 3.951 electronvolt
mo.energy: 3.999 electronvolt
energy: 7.164 6.771 6.194 -4.281 -2.134 2.714 1.329 4.354 -6.336 1.318 16.243 electronvolt
mo.energy: 4.064 electronvolt
energy: 7.137 10.332 1.318 6.307 electronvolt
mo.energy: 4.065 electronvolt
energy: 7.138 10.332 6.306 electronvolt
mo.energy: 4.575 electronvolt
energy: 7.835 -4.281 7.138 3.504 10.332 9.448 10.512 electronvolt
energy: 7.835 -4.281 7.137 3.503 10.332 9.449 1.318 10.512 electronvolt
mo.energy: 5.075 electronvolt
energy: 8.309 1.329 -6.336 -4.281 11.377 2.714 -2.134 16.243 10.092 9.037 6.194 1.318 7.164 9.362 1.318 9.655 4.964 3.952 electronvolt
energy: -4.281 7.835 2.714 8.540 1.318 10.332 7.137 8.877 1.318 9.449 10.512 3.503 13.669 13.250 6.384 15.900 8.954 15.003 12.580 14.256 18.005 -4.184 19.309 -25.370 9.910 11.936 electronvolt
energy: -4.281 7.835 2.714 8.541 1.318 10.332 7.138 8.878 9.448 10.512 1.318 3.504 1.318 13.669 13.249 6.385 15.903 15.001 12.581 8.954 14.256 18.006 -4.183 19.311 -25.370 9.910 11.935 electronvolt
