program: Gaussian 16
title: Title
version: ES64L-G16RevC.02
frameworkgroup: C1[X(C8H8B12I11O3S)]
method: RB3LYP
basis: def2TZVPP
operation: Freq
keyword: #N
keyword: Geom=AllCheck
keyword: Guess=TCheck
keyword: SCRF=Check
keyword: GenChk
keyword: RB3LYP/def2TZVPP
keyword: Freq
converged: YES YES NO YES
title: Mulliken charges:
elementType: B B B B B B B B B B B B I I I I I I I I I I I C C H H C C C C H C H C H H S O O O H H
charge: 0.005270 0.315579 0.074831 0.065130 -0.118962 -0.132633 0.033731 0.033600 -0.100371 -0.164897 -0.185471 -0.049532 -0.102359 0.138831 -0.086795 -0.088686 -0.088131 -0.105161 0.173537 -0.085393 -0.084275 -0.085785 -0.101120 -0.206624 -0.109678 0.064550 0.095662 0.037332 -0.192882 -0.103975 -0.123822 0.132021 -0.154003 0.130269 -0.057238 0.142639 0.148169 0.857547 -0.455905 -0.434404 -0.290199 0.207908 0.051697
chargesum: -1.00000
title: Mulliken charges with hydrogens summed into heavy atoms:
elementType: B B B B B B B B B B B B I I I I I I I I I I I C C C C C C C C S O O O
charge: 0.005270 0.315579 0.074831 0.065130 -0.118962 -0.132633 0.033731 0.033600 -0.100371 -0.164897 -0.185471 -0.049532 -0.102359 0.138831 -0.086795 -0.088686 -0.088131 -0.105161 0.225234 -0.085393 -0.084275 -0.085785 -0.101120 -0.110962 -0.045129 0.037332 -0.060860 0.026294 0.018817 -0.005834 -0.057238 0.857547 -0.455905 -0.434404 -0.082291
1716.lowfreq: -2.2213 -0.0010 0.0001 0.0006 1.1940 1.8937 8.9289 11.6382 16.3840
frequency: 8.9233 11.6351 16.3829 39.9425 45.3965 52.0037 53.1895 56.0985 56.3863 57.4127 60.5787 61.9495 62.4354 66.8133 67.9705 68.4329 69.7899 71.4577 72.4941 74.3923 77.8543 78.8416 80.7982 96.3548 117.5487 124.8772 127.8327 139.2178 143.2861 143.5310 143.8865 148.6548 150.1751 151.4999 162.3296 174.7564 196.8631 232.3164 265.0467 300.8280 324.5077 358.4664 361.3705 370.0212 373.3220 382.1996 395.3682 405.2528 419.6556 445.9900 475.3212 482.4599 497.1996 529.8460 543.1898 555.6693 556.4840 561.4079 563.8180 570.1603 572.5597 618.6006 649.5636 651.2229 652.4742 659.7114 675.7243 696.1194 707.3240 712.6914 715.2241 719.8264 739.4681 744.2469 765.3695 769.4934 775.0238 793.3952 800.2555 836.4311 839.7741 845.5499 854.9830 864.0734 872.7479 890.4247 902.3571 904.4801 906.1089 911.8303 917.3131 924.8867 941.6152 965.3076 989.4767 994.9262 1002.3201 1021.9521 1038.1409 1110.4628 1127.6209 1139.4524 1142.6477 1190.6705 1214.7660 1250.7235 1291.0741 1338.2755 1344.7827 1383.6454 1407.0720 1447.0114 1533.2436 1601.9747 1635.6496 1689.1465 3130.8773 3172.6142 3180.1345 3194.6607 3208.9498 3209.9351 3783.5737
redmass: 21.7903 6.3578 18.5445 4.7685 10.9501 95.6889 71.0070 53.1439 96.5084 72.5546 112.0300 54.1525 34.3817 82.3091 103.7774 95.0658 116.3223 79.7634 108.4715 84.0003 34.7132 32.9086 53.8005 15.4426 10.8927 3.6526 61.9727 50.0541 105.2615 88.6988 103.0526 105.7922 104.1677 114.4556 85.4676 2.7532 6.3065 2.2035 2.5036 9.3461 6.2495 6.7478 7.0870 10.9217 11.3035 5.8806 6.9631 4.8138 3.6927 5.6296 1.6255 4.6436 6.3822 1.0497 4.8719 10.5524 8.1210 8.9977 10.0772 9.1506 5.9405 10.0146 10.8379 7.1604 10.6620 10.3490 4.6103 8.5208 7.3140 8.0860 10.6222 10.5487 4.6646 8.5412 8.2234 10.1262 10.3331 9.3338 11.1470 1.9970 9.5446 4.6284 1.2996 6.8927 6.3803 3.6550 9.8517 6.8165 6.1614 4.4290 6.7034 9.9066 7.3537 4.3794 1.3255 1.3269 1.3635 1.1133 3.1938 3.9083 4.8487 1.2643 1.3429 5.2639 1.3793 2.3028 1.9437 1.3370 2.9426 1.4625 10.5142 2.7947 2.2242 6.2281 5.3325 5.8122 1.0861 1.0875 1.0888 1.0874 1.0927 1.0941 1.0655
irintensity: 0.5900 0.5608 0.6206 1.5840 0.9870 0.0567 0.0322 0.1782 0.0013 0.0166 0.0373 1.1391 0.4603 0.3873 0.2646 0.4204 0.0004 0.0112 0.0584 0.0146 0.0519 1.1880 1.6984 1.2147 2.1379 5.2141 3.6159 4.7219 0.0003 0.1060 0.0752 0.0441 0.4409 0.0340 4.1635 5.3184 6.0632 35.2093 55.4557 7.9647 14.6888 45.3086 27.6545 0.5046 10.1156 10.8169 8.2512 12.0217 3.1734 12.3684 1104.7753 120.3145 2.3852 0.7650 22.0845 5.0641 43.6429 12.5854 24.3047 15.6352 4.6284 95.4873 6.4926 0.2248 1.9478 2.3694 209.3786 77.7375 1.0634 4.2882 0.8735 0.7656 11.1231 9.7987 6.8551 9.6654 8.0954 1.0136 390.3757 11.4461 3.4628 45.4618 0.8016 12.2629 17.3541 5.5973 7.9226 2.3161 13.2414 11.2787 8.5277 116.7290 133.6587 234.4721 2.2173 131.9405 1.2782 18.4466 1.2375 43.6887 61.3542 65.8147 45.2107 421.5506 32.5035 6.3681 17.7082 5.8000 25.6865 5.1550 172.2744 17.5034 14.7454 5.9873 177.6654 2.5076 2.8721 2.7876 7.4918 0.8157 1.8261 0.1336 107.6538
temp: 298.150 k
press: 1.00000 atm
elementType: 5 5 5 5 5 5 5 5 5 5 5 5 53 53 53 53 53 53 53 53 53 53 53 6 6 1 1 6 6 6 6 1 6 1 6 1 1 16 8 8 8 1 1
symmnumber: 1
zpe: 543546.3 jmol-1
zpe.correction: 0.207026 hartree
zpe.thermalcorrener: 0.247942 hartree
zpe.thermalcorrenthalpy: 0.248887 hartree
zpe.thermalcorrgfe: 0.121153 hartree
zpe.sumelectzpe: -4508.565542 hartree
zpe.sumelectthermal: -4508.524625 hartree
zpe.sumelectthermalent: -4508.523681 hartree
zpe.sumelectthermalfe: -4508.651414 hartree
dipole: -1.2387 -4.2462 -0.1127
dipole: 4.4247
quadrupole: -574.6721 -467.0264 -469.9871
quadrupole: -6.2102 -19.6239 4.2172
quadrupole: -70.7769 36.8688 33.9081 -6.2102 -19.6239 4.2172
hfenergy: -4508.7725678 hartree
pointgroup: C01 [X(C8H8B12I11O3S1)]
dipole: -0.4641025 0.9357005 1.3926381 debye
polarizability: 776.285886|-6.3940685|600.3168574|-2.1791816|-8.0752793|560.8732884 unknown
InChI: InChI=1S/C8H8B12I11O3S/c21-10-9(6-5-7-1-3-8(4-2-7)35(32,33)34)11(10,22)13(10,24)14(10,25)12(9,10,23)17(14,28)15(13,14,26)16(11,13,27)18(15,17,29)19(9,11,16)20(9,12,17,18)31-36-30-19/h1-6,32H
charge -1 multiplicity 1
43 atoms
B  0.13477823 -1.58118814 -0.0394395
B  -0.92467143 -0.13148302 -0.0050723
B  0.00207874 1.11503275 0.86711839
B  2.49378844 0.0803128 -0.05653432
B  1.60823672 -1.19140562 -0.95052359
B  1.48985933 0.51539458 -1.47289524
B  -0.06206715 1.1676227 -0.88145787
B  0.11919671 -0.55402016 1.37274148
B  1.65223835 -1.21998426 0.83411154
B  1.56658246 0.4660201 1.40899323
B  1.46230946 1.54033017 -0.01142998
B  0.03176261 -0.51550438 -1.45777592
I  -0.7556168 -3.56632539 0.02219271
I  -1.08021596 2.48816194 2.20850062
I  4.65354073 0.21868089 -0.08285715
I  2.6335158 -2.69107941 -2.12644356
I  2.37041716 1.21238483 -3.32318647
I  -1.14794071 2.72843237 -1.9383591
I  -0.90583112 -1.0748409 3.25368609
I  2.68058366 -2.74137124 1.98611707
I  2.4842815 1.08978977 3.27507582
I  2.26400723 3.55379912 0.05420814
I  -1.00384106 -1.14017202 -3.25741283
C  -2.46916255 -0.34168597 0.06700119
C  -3.42100874 0.59535098 0.06903085
H  -3.14118059 1.63771581 -0.00348382
H  -2.77689462 -1.38156276 0.10484307
C  -4.8628024 0.36183675 0.12317594
C  -5.43167147 -0.91202405 0.28649294
C  -5.72630442 1.45955124 0.01350719
C  -6.80082488 -1.08194579 0.32852107
H  -4.7911441 -1.77625375 0.38518621
C  -7.10245749 1.3043312 0.04962261
H  -5.30223808 2.44765865 -0.10594442
C  -7.6348086 0.02984272 0.20443427
H  -7.23160972 -2.06319113 0.46469429
H  -7.76164033 2.15628551 -0.02757621
S  -9.37988829 -0.18976257 0.22499558
O  -10.01417445 1.09282603 0.35660252
O  -9.72102069 -1.28748191 1.07375577
O  -9.69911221 -0.7279864 -1.26628706
H  -9.75800098 0.03071514 -1.86193503
H  -1.26418468 0.7867575 3.14497673
