program: Gaussian 09
title: 000042490
version: EM64L-G09RevD.01
frameworkgroup: C1[X(C22H23ClF3N3O3)]
method: RPBEPBE
basis: SDD
operation: Freq
keyword: #p
keyword: freq=noraman
keyword: PBEPBE/SDD
title: #p freq=noraman PBEPBE/SDD
converged: YES YES NO NO
title: Mulliken charges:
elementType: Cl F F F O O O N N N C C C C C C C C C C C C C C C C C C C C C C H H H H H H H H H H H H H H H H H H H H H H H
charge: -0.035378 -0.171969 -0.135813 -0.135252 -0.295698 -0.337219 -0.209688 -0.079752 -0.424315 -0.443617 -0.064209 -0.433303 -0.460808 -0.384572 -0.384586 -0.476985 0.449719 0.156813 0.116892 -0.377172 -0.448347 0.292934 -0.227523 -0.220810 -0.349498 -0.245451 -0.474008 -0.465002 0.717813 -0.525597 0.141467 0.301289 0.269343 0.213232 0.240263 0.210224 0.216836 0.192827 0.239082 0.156906 0.221653 0.191465 0.219436 0.371530 0.263613 0.230305 0.224914 0.224512 0.311192 0.227598 0.320086 0.357084 0.241727 0.242145 0.243672
chargesum: 0.00000
title: Mulliken charges with hydrogens summed into heavy atoms:
elementType: Cl F F F O O O N N N C C C C C C C C C C C C C C C C C C C C C C
charge: -0.035378 -0.171969 -0.135813 -0.135252 -0.295698 -0.337219 -0.209688 -0.079752 -0.052785 -0.086533 0.205134 0.020192 -0.033748 0.047337 -0.006028 -0.066084 0.449719 0.156813 0.116892 -0.113559 -0.218042 0.292934 -0.002610 0.003702 -0.038306 -0.017853 -0.153922 -0.465002 0.717813 0.201946 0.141467 0.301289
polarizability: 4.03052439e+02 -2.19915281e+01 2.77525515e+02 -3.43179623e+00 -1.84312184e+01 2.09556788e+02
1716.lowfreq: -8.3269 -3.5946 0.0016 0.0018 0.0020 2.2894 8.0370 10.2306 22.4637
frequency: 7.3734 10.1620 22.4235 25.2026 28.9627 40.0720 45.9614 52.3584 58.9468 66.1283 81.6182 91.0648 113.3444 127.9138 153.2569 164.7705 168.2965 193.3262 205.0645 207.5554 208.7447 236.0984 238.5678 248.5092 265.9214 296.9739 303.2328 308.0845 321.2609 330.3718 352.8937 367.5222 381.0709 393.2133 401.8621 405.6976 419.2580 442.8942 445.0787 461.3688 464.7594 485.1023 501.5828 532.1407 586.9240 596.6691 599.7015 616.3844 628.1372 631.9505 662.7732 676.8041 696.2469 700.8439 703.2605 705.6314 730.1604 738.1721 759.4459 771.1605 784.1674 801.4425 805.5166 817.0673 854.5768 860.7918 881.1687 895.7920 902.9195 921.0803 942.9183 943.8274 967.6772 982.8474 986.5170 989.9187 994.7062 1003.8840 1009.1630 1013.6495 1025.9856 1027.1906 1037.4996 1051.8787 1076.1371 1089.7449 1096.1499 1099.9394 1113.0450 1116.4182 1135.1214 1145.0438 1157.1244 1170.2314 1174.8723 1180.6356 1184.1134 1190.0783 1211.0722 1229.4231 1235.9333 1251.9102 1253.6341 1268.7918 1279.1945 1293.6840 1304.6318 1311.9359 1332.1511 1341.1471 1344.1530 1358.7212 1369.5391 1381.1077 1381.7849 1397.3486 1398.9799 1440.5345 1443.4960 1445.4409 1456.2584 1459.6082 1462.9434 1469.0264 1471.2630 1476.1094 1479.9963 1482.8021 1505.6531 1518.2879 1572.3988 1594.6446 1596.6070 1614.3423 1617.8138 1639.1932 2781.8465 2835.1875 2846.4173 2982.6857 2982.7911 2997.3737 3001.4190 3020.5048 3027.9349 3047.6998 3063.5745 3072.3989 3081.6599 3110.5837 3122.9004 3133.4967 3135.6344 3147.1344 3157.6080 3161.6154 3193.8205 3433.1760 3444.9851
redmass: 6.9249 7.2123 10.2016 5.4560 5.7495 4.7985 7.3869 5.8711 6.9936 5.2203 5.1453 5.1709 5.7877 5.0235 6.8614 5.1859 5.7609 4.0343 9.9619 3.1530 2.3831 3.9943 3.2161 2.7705 3.9060 12.9693 4.1805 3.3819 2.4927 4.8225 2.8411 4.6766 10.7972 6.3451 3.2994 2.8557 2.7495 12.8361 7.3595 3.0462 3.4027 3.6936 12.7969 3.6464 7.4539 5.2210 4.3476 6.3750 7.5991 9.9636 7.7772 2.7379 1.1618 7.7380 3.3441 2.2312 7.7153 1.6202 4.5079 2.8646 1.3210 2.6238 2.2341 3.6424 6.6744 1.2493 3.3951 1.5554 2.1482 1.4648 3.3257 1.6439 2.8193 1.4635 1.7009 5.3220 2.0924 1.5053 6.0931 1.6325 2.1695 7.0895 12.7826 2.2577 1.6113 4.7703 1.4578 4.1059 1.2550 2.7333 2.6160 2.5643 1.3991 1.0576 2.2183 1.1134 1.1559 1.2953 2.5589 2.8346 2.4906 1.4326 1.4686 1.6148 3.2948 1.4189 1.5507 1.3909 1.4129 1.4209 1.4180 1.3886 1.4812 4.5137 3.5513 1.8638 4.5712 2.0860 1.3168 1.0910 1.0926 1.1325 1.9691 1.0489 1.1084 1.2426 1.2374 1.9021 1.9068 2.6932 4.0292 6.1714 5.7074 6.1203 6.4858 9.4939 1.0711 1.0718 1.0698 1.0326 1.0847 1.0632 1.0629 1.0842 1.0843 1.0879 1.1018 1.1015 1.1053 1.0873 1.0860 1.1020 1.0915 1.0953 1.0918 1.1014 1.0916 1.0768 1.0796
irintensity: 0.1291 0.0739 0.7028 0.0383 0.0253 0.2856 1.3643 0.7195 8.0043 1.2804 1.2418 0.5733 2.6227 4.9355 3.7690 3.8327 0.7818 0.6222 2.6923 3.5769 4.2691 2.9199 1.9821 2.2404 7.0343 3.2277 0.0398 4.5605 0.1504 1.6044 4.0689 5.3982 2.1145 10.4539 10.2299 0.2690 7.3563 4.8827 18.8296 8.0208 7.0114 0.5325 5.3796 5.0209 41.7451 3.2329 1.2860 0.2490 4.1999 15.8007 28.1319 2.4504 99.8333 1.5094 7.0256 29.1197 7.0470 54.7296 1.1036 24.9413 68.3019 10.9006 3.3077 8.9262 85.7207 0.2409 1.7218 33.6383 4.2863 3.7639 10.2853 14.5939 16.6761 2.7864 6.8921 1.8235 38.5138 4.4318 118.8367 5.6879 11.8059 81.0250 250.2251 25.5526 17.3230 280.3854 8.1773 63.8776 0.0747 49.4252 3.0199 24.3645 0.5582 0.4168 68.6752 3.4448 7.0488 4.5384 4.9536 98.6258 45.8689 28.2737 16.9408 13.5724 30.8230 32.8522 6.3508 24.1975 18.5302 11.4178 7.0446 6.0121 2.6286 30.3121 12.7985 7.7555 34.7538 12.0068 22.2824 19.6241 26.6605 32.4051 168.4626 13.3956 4.7034 7.9397 24.5274 34.7784 677.3158 24.9304 54.3014 1.0512 208.0725 8.1459 61.5037 309.8919 164.7313 37.6716 162.0812 31.2767 27.8982 18.8180 17.7627 48.0547 49.0652 28.2082 32.7124 36.2734 26.0942 10.0325 0.1102 17.8443 19.4552 30.6877 15.0418 29.2184 9.0447 90.7149 82.2026
temp: 298.150 k
press: 1.00000 atm
elementType: 17 9 9 9 8 8 8 7 7 7 6 6 6 6 6 6 6 6 6 6 6 6 6 6 6 6 6 6 6 6 6 6 1 1 1 1 1 1 1 1 1 1 1 1 1 1 1 1 1 1 1 1 1 1 1
symmnumber: 1
zpe: 1102868.0 jmol-1
zpe.correction: 0.420060 hartree
zpe.thermalcorrener: 0.450278 hartree
zpe.thermalcorrenthalpy: 0.451223 hartree
zpe.thermalcorrgfe: 0.352982 hartree
zpe.sumelectzpe: -1999.313297 hartree
zpe.sumelectthermal: -1999.283079 hartree
zpe.sumelectthermalent: -1999.282134 hartree
zpe.sumelectthermalfe: -1999.380375 hartree
dipole: -2.6526 -2.4322 2.2654
dipole: 4.2526
quadrupole: -212.1525 -205.7285 -187.6476
quadrupole: 11.8484 -2.6211 2.8439
quadrupole: -10.3096 -3.8856 14.1953 11.8484 -2.6211 2.8439
hfenergy: -1999.7333571 hartree
pointgroup: C01 [X(C22H23Cl1F3N3O3)]
dipole: -1.0091826 -0.9211509 0.9655435 debye
polarizability: 402.7498642|-22.562224|275.7815035|-9.040785|-20.4389075|211.6033745 unknown
InChI: InChI=1S/C22H23ClF3N3O3/c1-32-19-12-18(28-21(31)22(24,25)26)17(23)11-16(19)20(30)27-15-7-9-29(10-8-15)13-14-5-3-2-4-6-14/h2-6,11-12,15,27-28H,7-10,13H2,1H3
charge 0 multiplicity 1
55 atoms
Cl 4.870503 2.599815 -2.185236
F  7.791045 -0.420092 -1.544533
F  8.115132 -1.544021 0.405593
F  7.408405 -2.658825 -1.435626
O  -0.136486 3.437795 -0.767355
O  0.725963 -0.298197 1.107863
O  5.222315 -2.075857 0.429894
N  -4.29453 0.212433 0.726883
N  -0.950832 1.745827 0.60404
N  5.281373 -0.044572 -0.789975
C  -2.277509 2.377534 0.772255
C  -3.196853 2.116895 -0.451907
C  -2.954521 1.839145 2.053248
C  -3.631701 0.642667 -0.532399
C  -3.403206 0.369604 1.89712
C  -4.874033 -1.147298 0.630055
C  -6.09139 -1.218702 -0.288833
C  0.032486 2.328018 -0.158855
C  1.363048 1.603886 -0.249574
C  -7.036061 -0.161807 -0.313582
C  -6.323899 -2.363402 -1.089874
C  1.712544 0.353494 0.34778
C  -8.19285 -0.251566 -1.118383
C  -7.483946 -2.458694 -1.89334
C  2.353881 2.260582 -1.01817
C  -8.423601 -1.402591 -1.909089
C  2.997454 -0.207837 0.182423
C  3.624569 1.708759 -1.183297
C  3.974625 0.467588 -0.588942
C  1.047487 -1.591492 1.730383
C  5.797895 -1.220759 -0.29447
C  7.276347 -1.46214 -0.716187
H  -2.10453 3.4663 0.854704
H  -4.096125 2.75433 -0.353519
H  -2.669602 2.41556 -1.375045
H  -2.273354 1.938101 2.919932
H  -3.850232 2.454854 2.253957
H  -2.739196 -0.000635 -0.752204
H  -4.344787 0.50591 -1.364173
H  -2.500591 -0.300042 1.819976
H  -3.951837 0.053132 2.804155
H  -4.117678 -1.90393 0.295347
H  -5.18051 -1.443555 1.65437
H  -0.739098 0.845806 1.050472
H  -6.837634 0.727501 0.295043
H  -5.593843 -3.183158 -1.08739
H  -8.914677 0.573352 -1.13032
H  -7.650276 -3.350177 -2.508921
H  2.069822 3.216018 -1.471269
H  -9.321375 -1.472831 -2.533662
H  3.272368 -1.160355 0.63623
H  5.896222 0.54104 -1.372393
H  1.305318 -2.344345 0.963588
H  1.877587 -1.486239 2.45218
H  0.128673 -1.889629 2.255836
