program: QuantumEspresso
programVersion: 6.8
elementType: W S N
lattice: 19.022486 0.000000 0.000000 angstrom
lattice: -9.511243 16.473949 0.000000 angstrom
lattice: 0.000000 0.000000 19.022486 angstrom
elementType: W
elementType: S
elementType: N
formula: N2S71W36
InChI: InChI=1S/N2.71S.36W/c1-2;;;;;;;;;;;;;;;;;;;;;;;;;;;;;;;;;;;;;;;;;;;;;;;;;;;;;;;;;;;;;;;;;;;;;;;;;;;;;;;;;;;;;;;;;;;;;;;;;;;;;;;;;;;
109 atoms
W  0.015191 0.017912 -0.007006
S  1.635981 1.003531 1.528632
S  1.573162 0.920641 -1.629331
W  -1.5621 2.749858 -0.007006
S  0.101867 3.660693 1.528632
S  -0.001328 3.647737 -1.629331
W  -3.161982 5.489619 0.004229
S  -1.547456 6.384742 1.559159
S  -1.588507 6.408442 -1.584788
W  -4.753276 8.235622 0.014392
S  -3.162283 9.144562 1.588458
S  -3.170453 9.154714 -1.562203
W  -6.340826 10.985341 0.014392
S  -4.758165 11.90871 1.588458
S  -4.753457 11.896556 -1.562203
W  -7.923288 13.736444 0.004229
S  -6.340826 14.6871 1.559159
S  -6.340826 14.6397 -1.584788
W  3.170413 0.032382 -0.045587
S  4.704845 1.003531 1.528632
S  4.767665 0.920641 -1.629331
W  1.643897 2.779543 -0.103836
S  3.170413 3.660878 -1.724164
W  0.028043 5.475126 -0.045587
S  1.636299 6.318408 1.528632
S  1.595924 6.414257 -1.629331
W  -1.579521 8.230522 0.004229
S  0.012717 9.123264 1.584381
S  0.004253 9.153993 -1.566684
W  -3.170712 10.982461 0.0184
S  -1.587786 11.896364 1.597417
S  -1.582018 11.899693 -1.551175
W  -4.758365 13.736444 0.004229
S  -3.189108 14.668991 1.584381
S  -3.166728 14.646295 -1.566684
W  6.325635 0.017912 -0.007006
S  7.898922 0.930873 1.580289
S  7.929816 0.913036 -1.567942
W  4.69693 2.779543 -0.103836
S  6.238959 3.660693 1.528632
S  6.342154 3.647737 -1.629331
W  3.170413 5.423549 -0.103836
S  4.704527 6.318408 1.528632
S  4.744902 6.414257 -1.629331
W  1.593122 8.214865 -0.007006
S  3.170413 9.120888 1.580289
S  3.170413 9.156563 -1.567942
W  0.00109 10.974694 0.02355
S  1.58455 11.886853 1.603373
S  1.585663 11.89929 -1.546404
W  -1.591537 13.733206 0.02355
S  -0.009854 14.648443 1.603373
S  0.001472 14.643189 -1.546404
W  9.50406 0.004145 0.023466
S  11.087249 0.921288 1.603373
S  11.097462 0.914107 -1.546404
W  7.902926 2.749858 -0.007006
S  9.479826 3.66433 1.584381
S  9.510671 3.656295 -1.566684
W  6.312783 5.475126 -0.045587
S  7.888283 6.384742 1.559159
S  7.929333 6.408442 -1.584788
W  4.747704 8.214865 -0.007006
S  6.32811 9.123264 1.584381
S  6.336573 9.153993 -1.566684
W  3.170413 10.974344 0.023466
S  4.756276 11.886853 1.603373
S  4.755163 11.89929 -1.546404
W  1.583114 13.727083 0.033704
S  3.170413 14.64351 1.6099
S  3.170413 14.64351 -1.539507
W  12.681653 0.002418 0.033704
S  14.276056 0.921288 1.603373
S  14.265843 0.914107 -1.546404
W  11.089025 2.748685 0.02355
S  12.681653 3.663856 1.597417
S  12.681653 3.657197 -1.551175
W  9.502809 5.489619 0.004229
S  11.085771 6.403311 1.588458
S  11.098649 6.405311 -1.562203
W  7.920347 8.230522 0.004229
S  9.503109 9.144562 1.588458
S  9.511279 9.154714 -1.562203
W  6.339736 10.974694 0.02355
S  7.928612 11.896364 1.597417
S  7.922845 11.899693 -1.551175
W  4.757712 13.727083 0.033704
S  6.35068 14.648443 1.603373
S  6.339354 14.643189 -1.546404
W  15.859245 0.004145 0.023466
S  17.464385 0.930873 1.580289
S  17.433489 0.913036 -1.567942
W  14.27428 2.748685 0.02355
S  15.883479 3.66433 1.584381
S  15.852636 3.656295 -1.566684
W  12.681653 5.491662 0.0184
S  14.277534 6.403311 1.588458
S  14.264656 6.405311 -1.562203
W  11.094102 8.235622 0.014392
S  12.681653 9.152194 1.58973
S  12.681653 9.152194 -1.559772
W  9.51154 10.982461 0.0184
S  11.098991 11.90871 1.588458
S  11.094283 11.896556 -1.562203
W  7.932364 13.733206 0.02355
S  9.529935 14.668991 1.584381
S  9.507555 14.646295 -1.566684
N  3.170413 4.260881 3.693805
N  3.170413 3.060876 4.22607
fermiener: 1.3465 electronvolt
totalener: -96444.741342 electronvolt
